log: mesa-buildtest_m64_debug_builder.log

Started by remote host ::1
Building remotely on builder-02 (builder) in workspace /home/jenkins/workspace/Leeroy_3
 > git rev-parse --is-inside-work-tree # timeout=10
Fetching changes from 5 remote Git repositories
 > git config remote.local.url git://otc-mesa-ci.local/git/mesa_jenkins # timeout=10
Pruning obsolete local branches
Fetching upstream changes from git://otc-mesa-ci.local/git/mesa_jenkins
 > git --version # timeout=10
 > git fetch --tags --progress git://otc-mesa-ci.local/git/mesa_jenkins +refs/heads/*:refs/remotes/local/* --prune
 > git config remote.origin.url https://gitlab.freedesktop.org/Mesa_CI/mesa_jenkins.git # timeout=10
Pruning obsolete local branches
Fetching upstream changes from https://gitlab.freedesktop.org/Mesa_CI/mesa_jenkins.git
Setting http proxy: proxy.jf.intel.com:911
 > git fetch --tags --progress https://gitlab.freedesktop.org/Mesa_CI/mesa_jenkins.git +refs/heads/*:refs/remotes/origin/* --prune
 > git config remote.origin1.url https://gitlab.freedesktop.org/majanes/mesa_jenkins.git # timeout=10
Pruning obsolete local branches
Fetching upstream changes from https://gitlab.freedesktop.org/majanes/mesa_jenkins.git
Setting http proxy: proxy.jf.intel.com:911
 > git fetch --tags --progress https://gitlab.freedesktop.org/majanes/mesa_jenkins.git +refs/heads/*:refs/remotes/origin1/* --prune
 > git config remote.origin2.url https://gitlab.freedesktop.org/ngcortes/mesa_jenkins.git # timeout=10
Pruning obsolete local branches
Fetching upstream changes from https://gitlab.freedesktop.org/ngcortes/mesa_jenkins.git
Setting http proxy: proxy.jf.intel.com:911
 > git fetch --tags --progress https://gitlab.freedesktop.org/ngcortes/mesa_jenkins.git +refs/heads/*:refs/remotes/origin2/* --prune
 > git config remote.origin3.url https://gitlab.freedesktop.org/craftyguy/mesa_jenkins.git # timeout=10
Pruning obsolete local branches
Fetching upstream changes from https://gitlab.freedesktop.org/craftyguy/mesa_jenkins.git
Setting http proxy: proxy.jf.intel.com:911
 > git fetch --tags --progress https://gitlab.freedesktop.org/craftyguy/mesa_jenkins.git +refs/heads/*:refs/remotes/origin3/* --prune
 > git rev-parse d0761cb764931771c8b245c3f41fe5d64cd046fb^{commit} # timeout=10
Checking out Revision d0761cb764931771c8b245c3f41fe5d64cd046fb (detached)
 > git config core.sparsecheckout # timeout=10
 > git checkout -f d0761cb764931771c8b245c3f41fe5d64cd046fb
 > git rev-list d0761cb764931771c8b245c3f41fe5d64cd046fb # timeout=10
Set build name.
New build name is 'mesa-buildtest-aphogat_internal-m64-builder'
[Leeroy_3] $ /bin/sh -xe /tmp/hudson5339361252134600376.sh
+ python3 -u fetch_sources.py --project=mesa-buildtest amber=dabae261 crucible=db7cc39 cts=07bc5346e deqp=5bc90c70c drm=67a64bb9 glcts=8c439f307 glslang=51d672b8a kc-cts=64f5eea mesa=4ae34d435f9 mesa_ci=38f63c80 mesa_ci_internal=3cd8823 piglit=5c9df166dc spirvheaders=a3fdfe8 spirvtools=ef3290bbe vkrunner=1b4cc6b vulkancts=27e691f02 waffle=6c28e5f webgl=5fcfea8e0
Checking out mesa_ci commit (try 1/15)
Checking out mesa_ci_internal commit (try 1/15)
fetching git://otc-mesa-ci.local/git/mesa
Checking out specified commit (try 1/15)
+ ls /mnt/jenkins/results
+ mkdir -p /tmp/jenkins/5732861
+ [ builder = builder ]
+ unshare -m -r /bin/bash -c 
mount -o bind /tmp/jenkins/5732861 /tmp
unset revision
python3 -u mesa-buildtest/build.py --arch m64 --result_path /mnt/jenkins/results/aphogat_internal/042252ed0827fd481539aa7ae11a04b6/percheckin --config debug --type percheckin --hardware builder --action clean,build,test --shard 0 --env "" 

INFO: starting timer at: 1618426551.753865, time remaining is: 1499.9999740123749
 rsync -rlpD --exclude='*.o' --exclude='*.a' otc-mesa-ci.local::nfs/results/aphogat_internal/042252ed0827fd481539aa7ae11a04b6/percheckin/drm/m64 /tmp/build_root
 cp -al /tmp/build_root /tmp/orig_build_root
 git clean -xfd
Removing build_mesa-buildtest_m64/
Removing src/amd/compiler/__pycache__/
Removing src/amd/registers/__pycache__/
Removing src/compiler/nir/__pycache__/
Removing src/gallium/auxiliary/util/__pycache__/
Removing src/intel/genxml/__pycache__/
Removing src/mapi/glapi/gen/__pycache__/
Removing src/mapi/new/__pycache__/
Removing src/mesa/main/__pycache__/
Removing src/util/format/__pycache__/
Removing src/vulkan/util/__pycache__/
 git reset --hard HEAD
Updating files:  76% (6279/8247)
Updating files:  77% (6351/8247)
Updating files:  78% (6433/8247)
Updating files:  79% (6516/8247)
Updating files:  80% (6598/8247)
Updating files:  81% (6681/8247)
Updating files:  82% (6763/8247)
Updating files:  83% (6846/8247)
Updating files:  84% (6928/8247)
Updating files:  85% (7010/8247)
Updating files:  86% (7093/8247)
Updating files:  87% (7175/8247)
Updating files:  88% (7258/8247)
Updating files:  89% (7340/8247)
Updating files:  90% (7423/8247)
Updating files:  91% (7505/8247)
Updating files:  92% (7588/8247)
Updating files:  93% (7670/8247)
Updating files:  94% (7753/8247)
Updating files:  95% (7835/8247)
Updating files:  96% (7918/8247)
Updating files:  97% (8000/8247)
Updating files:  98% (8083/8247)
Updating files:  99% (8165/8247)
Updating files: 100% (8247/8247)
Updating files: 100% (8247/8247), done.
HEAD is now at 4ae34d435f9 intel: Rename _gen keyword to _gfx_ver in few build files
PKG_CONFIG_PATH=/tmp/build_root/m64/lib64/pkgconfig:/tmp/build_root/m64/lib/x86_64-linux-gnu/pkgconfig:/tmp/build_root/m64/lib/pkgconfig:/usr/lib64/pkgconfig:/usr/lib/x86_64-linux-gnu/pkgconfig:/usr/lib/pkgconfig CC=ccache gcc CXX=ccache g++ LD_LIBRARY_PATH=/tmp/build_root/m64/lib64:/tmp/build_root/m64/lib/x86_64-linux-gnu:/tmp/build_root/m64/lib:/usr/lib64:/usr/lib/x86_64-linux-gnu:/usr/lib meson /home/jenkins/workspace/Leeroy_3/repos/mesa/build_mesa-buildtest_m64 --prefix /tmp/build_root/m64 --libdir lib -Dbuild-tests=true -Dgallium-drivers=nouveau,v3d,vc4,panfrost,lima,etnaviv,tegra,zink,r600,swr,kmsro,swrast,virgl,auto,r300,radeonsi,iris,freedreno,svga -Dgallium-vdpau=true -Dgallium-xvmc=true -Dgallium-xa=true -Dgallium-va=true -Dgallium-nine=true -Dgallium-opencl=standalone -Dtools=all -Dgallium-omx=bellagio
Using 'PKG_CONFIG_PATH' from environment with value: '/tmp/build_root/m64/lib64/pkgconfig:/tmp/build_root/m64/lib/x86_64-linux-gnu/pkgconfig:/tmp/build_root/m64/lib/pkgconfig:/usr/lib64/pkgconfig:/usr/lib/x86_64-linux-gnu/pkgconfig:/usr/lib/pkgconfig'
Using 'PKG_CONFIG_PATH' from environment with value: '/tmp/build_root/m64/lib64/pkgconfig:/tmp/build_root/m64/lib/x86_64-linux-gnu/pkgconfig:/tmp/build_root/m64/lib/pkgconfig:/usr/lib64/pkgconfig:/usr/lib/x86_64-linux-gnu/pkgconfig:/usr/lib/pkgconfig'
The Meson build system
Version: 0.56.2
Source dir: /home/jenkins/workspace/Leeroy_3/repos/mesa
Build dir: /home/jenkins/workspace/Leeroy_3/repos/mesa/build_mesa-buildtest_m64
Build type: native build
Program python found: YES (/usr/bin/python)
Project name: mesa
Project version: 21.1.0-devel
Using 'CC' from environment with value: 'ccache gcc'
C compiler for the host machine: ccache gcc (gcc 9.3.0 "gcc (Debian 9.3.0-12) 9.3.0")
C linker for the host machine: gcc ld.bfd 2.34
Using 'CXX' from environment with value: 'ccache g++'
C++ compiler for the host machine: ccache g++ (gcc 9.3.0 "g++ (Debian 9.3.0-12) 9.3.0")
C++ linker for the host machine: g++ ld.bfd 2.34
Using 'CC' from environment with value: 'ccache gcc'
Using 'CXX' from environment with value: 'ccache g++'
Host machine cpu family: x86_64
Host machine cpu: x86_64
Found CMake: /usr/bin/cmake (3.16.3)
Run-time dependency clang found: NO (tried cmake)
meson.build:527: WARNING: gallium-vdpau option "true" deprecated, please use "enabled" instead.
Found pkg-config: /usr/bin/pkg-config (0.29.2)
Using 'PKG_CONFIG_PATH' from environment with value: '/tmp/build_root/m64/lib64/pkgconfig:/tmp/build_root/m64/lib/x86_64-linux-gnu/pkgconfig:/tmp/build_root/m64/lib/pkgconfig:/usr/lib64/pkgconfig:/usr/lib/x86_64-linux-gnu/pkgconfig:/usr/lib/pkgconfig'
Run-time dependency vdpau found: YES 1.4
meson.build:588: WARNING: gallium-xvmc option "true" deprecated, please use "enabled" instead.
Using 'PKG_CONFIG_PATH' from environment with value: '/tmp/build_root/m64/lib64/pkgconfig:/tmp/build_root/m64/lib/x86_64-linux-gnu/pkgconfig:/tmp/build_root/m64/lib/pkgconfig:/usr/lib64/pkgconfig:/usr/lib/x86_64-linux-gnu/pkgconfig:/usr/lib/pkgconfig'
Run-time dependency xvmc found: YES 1.0.12
Using 'PKG_CONFIG_PATH' from environment with value: '/tmp/build_root/m64/lib64/pkgconfig:/tmp/build_root/m64/lib/x86_64-linux-gnu/pkgconfig:/tmp/build_root/m64/lib/pkgconfig:/usr/lib64/pkgconfig:/usr/lib/x86_64-linux-gnu/pkgconfig:/usr/lib/pkgconfig'
Run-time dependency xv found: YES 1.0.11
Using 'PKG_CONFIG_PATH' from environment with value: '/tmp/build_root/m64/lib64/pkgconfig:/tmp/build_root/m64/lib/x86_64-linux-gnu/pkgconfig:/tmp/build_root/m64/lib/pkgconfig:/usr/lib64/pkgconfig:/usr/lib/x86_64-linux-gnu/pkgconfig:/usr/lib/pkgconfig'
Run-time dependency libomxil-bellagio found: YES 0.9.3
meson.build:709: WARNING: gallium-va option "true" deprecated, please use "enabled" instead.
Using 'PKG_CONFIG_PATH' from environment with value: '/tmp/build_root/m64/lib64/pkgconfig:/tmp/build_root/m64/lib/x86_64-linux-gnu/pkgconfig:/tmp/build_root/m64/lib/pkgconfig:/usr/lib64/pkgconfig:/usr/lib/x86_64-linux-gnu/pkgconfig:/usr/lib/pkgconfig'
Run-time dependency libva found: YES 1.7.0
meson.build:745: WARNING: gallium-xa option "true" deprecated, please use "enabled" instead.
Using 'PKG_CONFIG_PATH' from environment with value: '/tmp/build_root/m64/lib64/pkgconfig:/tmp/build_root/m64/lib/x86_64-linux-gnu/pkgconfig:/tmp/build_root/m64/lib/pkgconfig:/usr/lib64/pkgconfig:/usr/lib/x86_64-linux-gnu/pkgconfig:/usr/lib/pkgconfig'
Run-time dependency libclc found: YES 0.2.0
Program python3 found: YES (/usr/bin/python3)
Fetching value of define "ETIME" : 62 
Checking for function "bswap32" : YES 
Checking for function "bswap64" : YES 
Checking for function "clz" : YES 
Checking for function "clzll" : YES 
Checking for function "ctz" : YES 
Checking for function "expect" : YES 
Checking for function "ffs" : YES 
Checking for function "ffsll" : YES 
Checking for function "popcount" : YES 
Checking for function "popcountll" : YES 
Checking for function "unreachable" : YES 
Checking for function "types_compatible_p" : NO 
Compiler for C supports function attribute const: YES 
Compiler for C supports function attribute flatten: YES 
Compiler for C supports function attribute malloc: YES 
Compiler for C supports function attribute pure: YES 
Compiler for C supports function attribute unused: YES 
Compiler for C supports function attribute warn_unused_result: YES 
Compiler for C supports function attribute weak: YES 
Compiler for C supports function attribute format: YES 
Compiler for C supports function attribute packed: YES 
Compiler for C supports function attribute returns_nonnull: YES 
Compiler for C supports function attribute alias: YES 
Compiler for C supports function attribute noreturn: YES 
Compiler for C supports function attribute visibility:hidden: YES 
Checking if "__uint128_t" compiles: YES 
Compiler for C supports arguments -Werror=implicit-function-declaration: YES 
Compiler for C supports arguments -Werror=missing-prototypes: YES 
Compiler for C supports arguments -Werror=return-type: YES 
Compiler for C supports arguments -Werror=empty-body: YES 
Compiler for C supports arguments -Werror=incompatible-pointer-types: YES 
Compiler for C supports arguments -Werror=int-conversion: YES 
Compiler for C supports arguments -Wimplicit-fallthrough: YES 
Compiler for C supports arguments -Werror=thread-safety: NO 
Compiler for C supports arguments -Wno-missing-field-initializers: YES 
Compiler for C supports arguments -Wno-format-truncation: YES 
Compiler for C supports arguments -fno-math-errno: YES 
Compiler for C supports arguments -fno-trapping-math: YES 
Compiler for C supports arguments -Qunused-arguments: NO 
Compiler for C supports arguments -fno-common: YES 
Compiler for C supports arguments -Werror=format: YES 
Compiler for C supports arguments -Wformat-security: YES 
Compiler for C++ supports arguments -Werror=return-type: YES 
Compiler for C++ supports arguments -Werror=empty-body: YES 
Compiler for C++ supports arguments -Wno-non-virtual-dtor: YES 
Compiler for C++ supports arguments -Wno-missing-field-initializers: YES 
Compiler for C++ supports arguments -Wno-format-truncation: YES 
Compiler for C++ supports arguments -fno-math-errno: YES 
Compiler for C++ supports arguments -fno-trapping-math: YES 
Compiler for C++ supports arguments -Qunused-arguments: NO 
Compiler for C++ supports arguments -flifetime-dse=1: YES 
Compiler for C++ supports arguments -Werror=format: YES 
Compiler for C++ supports arguments -Wformat-security: YES 
Compiler for C supports arguments -Wno-override-init: YES 
Compiler for C supports arguments -Wno-initializer-overrides: NO 
Compiler for C supports arguments -Werror=pointer-arith: YES 
Compiler for C++ supports arguments -Werror=pointer-arith: YES 
Compiler for C supports arguments -Werror=gnu-empty-initializer: NO 
Compiler for C++ supports arguments -Werror=gnu-empty-initializer: NO 
Compiler for C supports arguments -Wmicrosoft-enum-value: NO 
Checking if "GCC atomic builtins" compiles: YES 
Checking if "GCC atomic builtins required -latomic" links: YES 
Checking if "GCC 64bit atomics" with dependency not-found links: YES 
Library ws2_32 found: NO
Header <sys/sysmacros.h> has symbol "major" : YES 
Header <sys/sysmacros.h> has symbol "minor" : YES 
Header <sys/sysmacros.h> has symbol "makedev" : YES 
Header <sys/mkdev.h> has symbol "major" : NO 
Check usable header "xlocale.h" : NO 
Check usable header "linux/futex.h" : YES 
Check usable header "endian.h" : YES 
Check usable header "dlfcn.h" : YES 
Check usable header "execinfo.h" : YES 
Check usable header "sys/shm.h" : YES 
Check usable header "cet.h" : YES 
Check usable header "pthread_np.h" : NO 
Checking for function "strtof" : YES 
Checking for function "mkostemp" : YES 
Checking for function "timespec_get" : YES 
Checking for function "memfd_create" : YES 
Checking for function "random_r" : YES 
Checking for function "flock" : YES 
Checking for function "strtok_r" : YES 
Checking for function "getrandom" : YES 
Header <errno.h> has symbol "program_invocation_name" : YES 
Checking for function "posix_memalign" : YES 
Checking whether type "struct dirent" has member "d_type" : YES 
Checking if "strtod has locale support" links: YES 
Checking if "Bsymbolic" links: YES 
Checking if "gc-sections" links: YES 
Checking if "version-script" links: YES 
Checking if "dynamic-list" links: YES 
Compiler for C supports link arguments -Wl,--build-id=sha1: YES 
Checking for function "dlopen" : NO 
Library dl found: YES
Checking for function "dladdr" with dependency -ldl: YES 
Checking for function "dl_iterate_phdr" : YES 
Checking for function "clock_gettime" : YES 
Using 'PKG_CONFIG_PATH' from environment with value: '/tmp/build_root/m64/lib64/pkgconfig:/tmp/build_root/m64/lib/x86_64-linux-gnu/pkgconfig:/tmp/build_root/m64/lib/pkgconfig:/usr/lib64/pkgconfig:/usr/lib/x86_64-linux-gnu/pkgconfig:/usr/lib/pkgconfig'
Run-time dependency zlib found: YES 1.2.11
Using 'PKG_CONFIG_PATH' from environment with value: '/tmp/build_root/m64/lib64/pkgconfig:/tmp/build_root/m64/lib/x86_64-linux-gnu/pkgconfig:/tmp/build_root/m64/lib/pkgconfig:/usr/lib64/pkgconfig:/usr/lib/x86_64-linux-gnu/pkgconfig:/usr/lib/pkgconfig'
Run-time dependency libzstd found: YES 1.4.4
Run-time dependency threads found: YES
Checking for function "pthread_setaffinity_np" with dependency threads: YES 
Using 'PKG_CONFIG_PATH' from environment with value: '/tmp/build_root/m64/lib64/pkgconfig:/tmp/build_root/m64/lib/x86_64-linux-gnu/pkgconfig:/tmp/build_root/m64/lib/pkgconfig:/usr/lib64/pkgconfig:/usr/lib/x86_64-linux-gnu/pkgconfig:/usr/lib/pkgconfig'
Run-time dependency expat found: YES 2.2.9
Library m found: YES
Message: libdrm 2.4.105 needed because amdgpu has the highest requirement
Using 'PKG_CONFIG_PATH' from environment with value: '/tmp/build_root/m64/lib64/pkgconfig:/tmp/build_root/m64/lib/x86_64-linux-gnu/pkgconfig:/tmp/build_root/m64/lib/pkgconfig:/usr/lib64/pkgconfig:/usr/lib/x86_64-linux-gnu/pkgconfig:/usr/lib/pkgconfig'
Run-time dependency libdrm_intel found: YES 2.4.105
Using 'PKG_CONFIG_PATH' from environment with value: '/tmp/build_root/m64/lib64/pkgconfig:/tmp/build_root/m64/lib/x86_64-linux-gnu/pkgconfig:/tmp/build_root/m64/lib/pkgconfig:/usr/lib64/pkgconfig:/usr/lib/x86_64-linux-gnu/pkgconfig:/usr/lib/pkgconfig'
Run-time dependency libdrm_amdgpu found: YES 2.4.105
Using 'PKG_CONFIG_PATH' from environment with value: '/tmp/build_root/m64/lib64/pkgconfig:/tmp/build_root/m64/lib/x86_64-linux-gnu/pkgconfig:/tmp/build_root/m64/lib/pkgconfig:/usr/lib64/pkgconfig:/usr/lib/x86_64-linux-gnu/pkgconfig:/usr/lib/pkgconfig'
Run-time dependency libdrm_radeon found: YES 2.4.105
Using 'PKG_CONFIG_PATH' from environment with value: '/tmp/build_root/m64/lib64/pkgconfig:/tmp/build_root/m64/lib/x86_64-linux-gnu/pkgconfig:/tmp/build_root/m64/lib/pkgconfig:/usr/lib64/pkgconfig:/usr/lib/x86_64-linux-gnu/pkgconfig:/usr/lib/pkgconfig'
Run-time dependency libdrm_nouveau found: YES 2.4.105
Using 'PKG_CONFIG_PATH' from environment with value: '/tmp/build_root/m64/lib64/pkgconfig:/tmp/build_root/m64/lib/x86_64-linux-gnu/pkgconfig:/tmp/build_root/m64/lib/pkgconfig:/usr/lib64/pkgconfig:/usr/lib/x86_64-linux-gnu/pkgconfig:/usr/lib/pkgconfig'
Run-time dependency libdrm found: YES 2.4.105
WARNING: Optional LLVM module frontendopenmp was not found
WARNING: CMake: Dependency z for LLVM target LLVMSupport was not found
WARNING: CMake: Dependency rt for LLVM target LLVMSupport was not found
WARNING: CMake: Dependency dl for LLVM target LLVMSupport was not found
WARNING: CMake: Dependency tinfo for LLVM target LLVMSupport was not found
WARNING: CMake: Dependency m for LLVM target LLVMSupport was not found
WARNING: Ignoring LLVM CMake dependency because dynamic was requested
llvm-config found: YES (/usr/bin/llvm-config) 9.0.1
Run-time dependency LLVM (modules: amdgpu, asmparser, bitreader, bitwriter, core, coverage, engine, executionengine, instcombine, instrumentation, ipo, irreader, linker, lto, mcdisassembler, mcjit, native, objcarcopts, option, profiledata, scalaropts, transformutils, coroutines, frontendopenmp(missing but optional)) found: YES 9.0.1
Using 'PKG_CONFIG_PATH' from environment with value: '/tmp/build_root/m64/lib64/pkgconfig:/tmp/build_root/m64/lib/x86_64-linux-gnu/pkgconfig:/tmp/build_root/m64/lib/pkgconfig:/usr/lib64/pkgconfig:/usr/lib/x86_64-linux-gnu/pkgconfig:/usr/lib/pkgconfig'
Run-time dependency libelf found: YES 0.176
Using 'PKG_CONFIG_PATH' from environment with value: '/tmp/build_root/m64/lib64/pkgconfig:/tmp/build_root/m64/lib/x86_64-linux-gnu/pkgconfig:/tmp/build_root/m64/lib/pkgconfig:/usr/lib64/pkgconfig:/usr/lib/x86_64-linux-gnu/pkgconfig:/usr/lib/pkgconfig'
Run-time dependency valgrind found: YES 3.15.0
Program bison found: YES (/usr/bin/bison)
Program bison found: YES 3.6.1 (/usr/bin/bison)
Program flex found: YES (/usr/bin/flex)
Run-time dependency libunwind found: NO (tried pkgconfig and cmake)
Found pkg-config: /usr/bin/pkg-config (0.29.2)
Using 'PKG_CONFIG_PATH' from environment with value: '/tmp/build_root/m64/lib64/pkgconfig:/tmp/build_root/m64/lib/x86_64-linux-gnu/pkgconfig:/tmp/build_root/m64/lib/pkgconfig:/usr/lib64/pkgconfig:/usr/lib/x86_64-linux-gnu/pkgconfig:/usr/lib/pkgconfig'
Build-time dependency wayland-scanner found: YES 1.18.0
Program /usr/bin/wayland-scanner found: YES (/usr/bin/wayland-scanner)
Using 'PKG_CONFIG_PATH' from environment with value: '/tmp/build_root/m64/lib64/pkgconfig:/tmp/build_root/m64/lib/x86_64-linux-gnu/pkgconfig:/tmp/build_root/m64/lib/pkgconfig:/usr/lib64/pkgconfig:/usr/lib/x86_64-linux-gnu/pkgconfig:/usr/lib/pkgconfig'
Run-time dependency wayland-protocols found: YES 1.20
Using 'PKG_CONFIG_PATH' from environment with value: '/tmp/build_root/m64/lib64/pkgconfig:/tmp/build_root/m64/lib/x86_64-linux-gnu/pkgconfig:/tmp/build_root/m64/lib/pkgconfig:/usr/lib64/pkgconfig:/usr/lib/x86_64-linux-gnu/pkgconfig:/usr/lib/pkgconfig'
Run-time dependency wayland-client found: YES 1.18.0
Using 'PKG_CONFIG_PATH' from environment with value: '/tmp/build_root/m64/lib64/pkgconfig:/tmp/build_root/m64/lib/x86_64-linux-gnu/pkgconfig:/tmp/build_root/m64/lib/pkgconfig:/usr/lib64/pkgconfig:/usr/lib/x86_64-linux-gnu/pkgconfig:/usr/lib/pkgconfig'
Run-time dependency wayland-server found: YES 1.18.0
Using 'PKG_CONFIG_PATH' from environment with value: '/tmp/build_root/m64/lib64/pkgconfig:/tmp/build_root/m64/lib/x86_64-linux-gnu/pkgconfig:/tmp/build_root/m64/lib/pkgconfig:/usr/lib64/pkgconfig:/usr/lib/x86_64-linux-gnu/pkgconfig:/usr/lib/pkgconfig'
Run-time dependency wayland-egl-backend found: YES 3
Run-time dependency OpenMP found: YES 4.5
Using 'PKG_CONFIG_PATH' from environment with value: '/tmp/build_root/m64/lib64/pkgconfig:/tmp/build_root/m64/lib/x86_64-linux-gnu/pkgconfig:/tmp/build_root/m64/lib/pkgconfig:/usr/lib64/pkgconfig:/usr/lib/x86_64-linux-gnu/pkgconfig:/usr/lib/pkgconfig'
Run-time dependency x11 found: YES 1.6.9
Using 'PKG_CONFIG_PATH' from environment with value: '/tmp/build_root/m64/lib64/pkgconfig:/tmp/build_root/m64/lib/x86_64-linux-gnu/pkgconfig:/tmp/build_root/m64/lib/pkgconfig:/usr/lib64/pkgconfig:/usr/lib/x86_64-linux-gnu/pkgconfig:/usr/lib/pkgconfig'
Run-time dependency xext found: YES 1.3.3
Using 'PKG_CONFIG_PATH' from environment with value: '/tmp/build_root/m64/lib64/pkgconfig:/tmp/build_root/m64/lib/x86_64-linux-gnu/pkgconfig:/tmp/build_root/m64/lib/pkgconfig:/usr/lib64/pkgconfig:/usr/lib/x86_64-linux-gnu/pkgconfig:/usr/lib/pkgconfig'
Run-time dependency xfixes found: YES 5.0.3
Using 'PKG_CONFIG_PATH' from environment with value: '/tmp/build_root/m64/lib64/pkgconfig:/tmp/build_root/m64/lib/x86_64-linux-gnu/pkgconfig:/tmp/build_root/m64/lib/pkgconfig:/usr/lib64/pkgconfig:/usr/lib/x86_64-linux-gnu/pkgconfig:/usr/lib/pkgconfig'
Run-time dependency xcb-glx found: YES 1.14
Using 'PKG_CONFIG_PATH' from environment with value: '/tmp/build_root/m64/lib64/pkgconfig:/tmp/build_root/m64/lib/x86_64-linux-gnu/pkgconfig:/tmp/build_root/m64/lib/pkgconfig:/usr/lib64/pkgconfig:/usr/lib/x86_64-linux-gnu/pkgconfig:/usr/lib/pkgconfig'
Run-time dependency xcb-shm found: YES 1.14
Using 'PKG_CONFIG_PATH' from environment with value: '/tmp/build_root/m64/lib64/pkgconfig:/tmp/build_root/m64/lib/x86_64-linux-gnu/pkgconfig:/tmp/build_root/m64/lib/pkgconfig:/usr/lib64/pkgconfig:/usr/lib/x86_64-linux-gnu/pkgconfig:/usr/lib/pkgconfig'
Run-time dependency xcb found: YES 1.14
Using 'PKG_CONFIG_PATH' from environment with value: '/tmp/build_root/m64/lib64/pkgconfig:/tmp/build_root/m64/lib/x86_64-linux-gnu/pkgconfig:/tmp/build_root/m64/lib/pkgconfig:/usr/lib64/pkgconfig:/usr/lib/x86_64-linux-gnu/pkgconfig:/usr/lib/pkgconfig'
Run-time dependency x11-xcb found: YES 1.6.9
Using 'PKG_CONFIG_PATH' from environment with value: '/tmp/build_root/m64/lib64/pkgconfig:/tmp/build_root/m64/lib/x86_64-linux-gnu/pkgconfig:/tmp/build_root/m64/lib/pkgconfig:/usr/lib64/pkgconfig:/usr/lib/x86_64-linux-gnu/pkgconfig:/usr/lib/pkgconfig'
Run-time dependency xcb-dri2 found: YES 1.14
Using 'PKG_CONFIG_PATH' from environment with value: '/tmp/build_root/m64/lib64/pkgconfig:/tmp/build_root/m64/lib/x86_64-linux-gnu/pkgconfig:/tmp/build_root/m64/lib/pkgconfig:/usr/lib64/pkgconfig:/usr/lib/x86_64-linux-gnu/pkgconfig:/usr/lib/pkgconfig'
Run-time dependency xcb-dri3 found: YES 1.14
Using 'PKG_CONFIG_PATH' from environment with value: '/tmp/build_root/m64/lib64/pkgconfig:/tmp/build_root/m64/lib/x86_64-linux-gnu/pkgconfig:/tmp/build_root/m64/lib/pkgconfig:/usr/lib64/pkgconfig:/usr/lib/x86_64-linux-gnu/pkgconfig:/usr/lib/pkgconfig'
Run-time dependency xcb-present found: YES 1.14
Using 'PKG_CONFIG_PATH' from environment with value: '/tmp/build_root/m64/lib64/pkgconfig:/tmp/build_root/m64/lib/x86_64-linux-gnu/pkgconfig:/tmp/build_root/m64/lib/pkgconfig:/usr/lib64/pkgconfig:/usr/lib/x86_64-linux-gnu/pkgconfig:/usr/lib/pkgconfig'
Run-time dependency xcb-sync found: YES 1.14
Using 'PKG_CONFIG_PATH' from environment with value: '/tmp/build_root/m64/lib64/pkgconfig:/tmp/build_root/m64/lib/x86_64-linux-gnu/pkgconfig:/tmp/build_root/m64/lib/pkgconfig:/usr/lib64/pkgconfig:/usr/lib/x86_64-linux-gnu/pkgconfig:/usr/lib/pkgconfig'
Run-time dependency xshmfence found: YES 1.3
Using 'PKG_CONFIG_PATH' from environment with value: '/tmp/build_root/m64/lib64/pkgconfig:/tmp/build_root/m64/lib/x86_64-linux-gnu/pkgconfig:/tmp/build_root/m64/lib/pkgconfig:/usr/lib64/pkgconfig:/usr/lib/x86_64-linux-gnu/pkgconfig:/usr/lib/pkgconfig'
Run-time dependency glproto found: YES 1.4.17
Using 'PKG_CONFIG_PATH' from environment with value: '/tmp/build_root/m64/lib64/pkgconfig:/tmp/build_root/m64/lib/x86_64-linux-gnu/pkgconfig:/tmp/build_root/m64/lib/pkgconfig:/usr/lib64/pkgconfig:/usr/lib/x86_64-linux-gnu/pkgconfig:/usr/lib/pkgconfig'
Run-time dependency dri2proto found: YES 2.8
Using 'PKG_CONFIG_PATH' from environment with value: '/tmp/build_root/m64/lib64/pkgconfig:/tmp/build_root/m64/lib/x86_64-linux-gnu/pkgconfig:/tmp/build_root/m64/lib/pkgconfig:/usr/lib64/pkgconfig:/usr/lib/x86_64-linux-gnu/pkgconfig:/usr/lib/pkgconfig'
Run-time dependency xxf86vm found: YES 1.1.4
Using 'PKG_CONFIG_PATH' from environment with value: '/tmp/build_root/m64/lib64/pkgconfig:/tmp/build_root/m64/lib/x86_64-linux-gnu/pkgconfig:/tmp/build_root/m64/lib/pkgconfig:/usr/lib64/pkgconfig:/usr/lib/x86_64-linux-gnu/pkgconfig:/usr/lib/pkgconfig'
Run-time dependency xcb-xfixes found: YES 1.14
Using 'PKG_CONFIG_PATH' from environment with value: '/tmp/build_root/m64/lib64/pkgconfig:/tmp/build_root/m64/lib/x86_64-linux-gnu/pkgconfig:/tmp/build_root/m64/lib/pkgconfig:/usr/lib64/pkgconfig:/usr/lib/x86_64-linux-gnu/pkgconfig:/usr/lib/pkgconfig'
Run-time dependency xcb-randr found: YES 1.14
Using 'PKG_CONFIG_PATH' from environment with value: '/tmp/build_root/m64/lib64/pkgconfig:/tmp/build_root/m64/lib/x86_64-linux-gnu/pkgconfig:/tmp/build_root/m64/lib/pkgconfig:/usr/lib64/pkgconfig:/usr/lib/x86_64-linux-gnu/pkgconfig:/usr/lib/pkgconfig'
Run-time dependency xrandr found: YES 1.5.1
Library sensors found: NO
Compiler for C supports link arguments -Wl,--gc-sections: YES 
Compiler for C supports arguments -ffunction-sections: YES 
Compiler for C supports arguments -fdata-sections: YES 
Program nm found: YES (/usr/bin/nm)
Program symbols-check.py found: YES (/usr/bin/env python /home/jenkins/workspace/Leeroy_3/repos/mesa/bin/symbols-check.py)
Program install_megadrivers.py found: YES (/usr/bin/python3 /home/jenkins/workspace/Leeroy_3/repos/mesa/bin/install_megadrivers.py)
Program xmllint found: YES (/usr/bin/xmllint)
Compiler for C++ supports arguments -std=c++2a: YES 
Has header "sys/time.h" : YES 
WARNING: Library target 'GLESv1_CM' has 'name_prefix' set. Compilers may not find it from its '-lGLESv1_CM' linker flag in the 'glesv1_cm.pc' pkg-config file.
WARNING: Library target 'GLESv1_CM' has 'name_prefix' set. Compilers may not find it from its '-lGLESv1_CM' linker flag in the 'glesv1_cm-uninstalled.pc' pkg-config file.
WARNING: Library target 'GLESv2' has 'name_prefix' set. Compilers may not find it from its '-lGLESv2' linker flag in the 'glesv2.pc' pkg-config file.
WARNING: Library target 'GLESv2' has 'name_prefix' set. Compilers may not find it from its '-lGLESv2' linker flag in the 'glesv2-uninstalled.pc' pkg-config file.
Checking for function "mmap" : YES 
Compiler for C++ supports arguments -Wno-unused-variable: YES 
Compiler for C++ supports arguments -Wno-unused-local-typedefs: YES 
Compiler for C++ supports arguments -Wno-unused-but-set-variable: YES 
Compiler for C++ supports arguments -Wno-maybe-uninitialized: YES 
Message: ['-DADDR_FASTCALL=', '-DLITTLEENDIAN_CPU', '-Wno-unused-variable', '-Wno-unused-local-typedefs', '-Wno-unused-but-set-variable', '-Wno-maybe-uninitialized']
Compiler for C++ supports arguments -fno-exceptions: YES 
Compiler for C++ supports arguments -fno-rtti: YES 
Compiler for C++ supports arguments -Wimplicit-fallthrough: YES 
Compiler for C++ supports arguments -Wshadow: YES 
Compiler for C++ supports arguments -DNOMINMAX: YES 
Compiler for C supports arguments -Wimplicit-fallthrough: YES (cached)
Compiler for C supports arguments -Wshadow: YES 
Configuring intel_sanitize_gpu using configuration
Configuring intel_dump_gpu using configuration
Configuring intel_stub_gpu using configuration
Using 'PKG_CONFIG_PATH' from environment with value: '/tmp/build_root/m64/lib64/pkgconfig:/tmp/build_root/m64/lib/x86_64-linux-gnu/pkgconfig:/tmp/build_root/m64/lib/pkgconfig:/usr/lib64/pkgconfig:/usr/lib/x86_64-linux-gnu/pkgconfig:/usr/lib/pkgconfig'
Run-time dependency epoxy found: YES 1.5.4
Using 'PKG_CONFIG_PATH' from environment with value: '/tmp/build_root/m64/lib64/pkgconfig:/tmp/build_root/m64/lib/x86_64-linux-gnu/pkgconfig:/tmp/build_root/m64/lib/pkgconfig:/usr/lib64/pkgconfig:/usr/lib/x86_64-linux-gnu/pkgconfig:/usr/lib/pkgconfig'
Run-time dependency gtk+-3.0 found: YES 3.24.20
Program tests/run-test.py found: YES (/home/jenkins/workspace/Leeroy_3/repos/mesa/src/intel/tools/tests/run-test.py)
Program /home/jenkins/workspace/Leeroy_3/repos/mesa/bin/install_megadrivers.py found: YES (/usr/bin/python3 /home/jenkins/workspace/Leeroy_3/repos/mesa/bin/install_megadrivers.py)
Program dispatch-index-check found: YES (/home/jenkins/workspace/Leeroy_3/repos/mesa/src/glx/tests/dispatch-index-check)
Checking for function "mincore" : YES 
Compiler for C++ supports arguments -Wno-ignored-attributes: YES 
Library clang-cpp found: YES
Compiler for C++ supports link arguments -Wl,--rpath=/usr/lib/llvm-9/lib: YES 
Checking if "dep-clang-usable" with dependencies LLVM, -lclang-cpp runs: YES
Program /home/jenkins/workspace/Leeroy_3/repos/mesa/bin/install_megadrivers.py found: YES (/usr/bin/python3 /home/jenkins/workspace/Leeroy_3/repos/mesa/bin/install_megadrivers.py)
Program /home/jenkins/workspace/Leeroy_3/repos/mesa/bin/install_megadrivers.py found: YES (/usr/bin/python3 /home/jenkins/workspace/Leeroy_3/repos/mesa/bin/install_megadrivers.py)
Using 'PKG_CONFIG_PATH' from environment with value: '/tmp/build_root/m64/lib64/pkgconfig:/tmp/build_root/m64/lib/x86_64-linux-gnu/pkgconfig:/tmp/build_root/m64/lib/pkgconfig:/usr/lib64/pkgconfig:/usr/lib/x86_64-linux-gnu/pkgconfig:/usr/lib/pkgconfig'
Run-time dependency xvmc-wrapper found: YES 1.0.12
Dependency xvmc found: YES 1.0.12 (cached)
Program /home/jenkins/workspace/Leeroy_3/repos/mesa/bin/install_megadrivers.py found: YES (/usr/bin/python3 /home/jenkins/workspace/Leeroy_3/repos/mesa/bin/install_megadrivers.py)
Program /home/jenkins/workspace/Leeroy_3/repos/mesa/bin/install_megadrivers.py found: YES (/usr/bin/python3 /home/jenkins/workspace/Leeroy_3/repos/mesa/bin/install_megadrivers.py)
Configuring xa_tracker.h using configuration
Message: Configuration summary:
        
        prefix:          /tmp/build_root/m64
        libdir:          lib
        includedir:      include
        
        OpenGL:          yes (ES1: yes ES2: yes)
        OSMesa:          no
        
        DRI platform:    drm
        DRI drivers:     i915 i965 r100 r200 nouveau
        DRI driver dir:  /tmp/build_root/m64/lib/dri
        
        GLX:             DRI-based
        
        EGL:             yes
        EGL drivers:     builtin:egl_dri2 builtin:egl_dri3
        GBM:             yes
        EGL/Vulkan/VL platforms:   x11 wayland surfaceless drm
        
        Vulkan drivers:  amd intel swrast
        Vulkan ICD dir:  share/vulkan/icd.d
        
        llvm:            yes
        llvm-version:    9.0.1
        
        Gallium drivers: r300 r600 radeonsi nouveau virgl svga swrast iris
        Gallium st:      mesa xa xvmc xvmc vdpau omxbellagio va nine clover
        HUD lmsensors:   no
        
        Shared-glapi:    yes

Build targets in project: 387

Found ninja-1.10.0 at /usr/bin/ninja
 meson configure /home/jenkins/workspace/Leeroy_3/repos/mesa/build_mesa-buildtest_m64
Core properties:
  Source dir /home/jenkins/workspace/Leeroy_3/repos/mesa
  Build dir  /home/jenkins/workspace/Leeroy_3/repos/mesa/build_mesa-buildtest_m64
                                                                                                                                                                                                                                                                                                    
Main project options:                                                                                                                                                                                                                                                                               
                                                                                                                                                                                                                                                                                                    
  Core options            Current Value                                                                                                                                                                                               Possible Values                                               Description
  ------------            -------------                                                                                                                                                                                               ---------------                                               -----------
  auto_features           auto                                                                                                                                                                                                        [enabled, disabled, auto]                                     Override value of all 'auto' features
  backend                 ninja                                                                                                                                                                                                       [ninja, vs, vs2010, vs2015, vs2017, vs2019, xcode]            Backend to use
  buildtype               debugoptimized                                                                                                                                                                                              [plain, debug, debugoptimized, release, minsize, custom]      Build type to use
  debug                   true                                                                                                                                                                                                        [true, false]                                                 Debug
  default_library         shared                                                                                                                                                                                                      [shared, static, both]                                        Default library type
  force_fallback_for      []                                                                                                                                                                                                                                                                        Force fallback for those subprojects
  install_umask           0022                                                                                                                                                                                                        [preserve, 0000-0777]                                         Default umask to apply on permissions of installed files
  layout                  mirror                                                                                                                                                                                                      [mirror, flat]                                                Build directory layout
  optimization            2                                                                                                                                                                                                           [0, g, 1, 2, 3, s]                                            Optimization level
  strip                   false                                                                                                                                                                                                       [true, false]                                                 Strip targets on install
  unity                   off                                                                                                                                                                                                         [on, off, subprojects]                                        Unity build
  unity_size              4                                                                                                                                                                                                           >=2                                                           Unity block size
  warning_level           1                                                                                                                                                                                                           [0, 1, 2, 3]                                                  Compiler warning level to use
  werror                  false                                                                                                                                                                                                       [true, false]                                                 Treat warnings as errors
  wrap_mode               default                                                                                                                                                                                                     [default, nofallback, nodownload, forcefallback]              Wrap mode
  cmake_prefix_path       []                                                                                                                                                                                                                                                                        List of additional prefixes for cmake to search
  pkg_config_path         [/tmp/build_root/m64/lib64/pkgconfig, /tmp/build_root/m64/lib/x86_64-linux-gnu/pkgconfig, /tmp/build_root/m64/lib/pkgconfig, /usr/lib64/pkgconfig, /usr/lib/x86_64-linux-gnu/pkgconfig, /usr/lib/pkgconfig]                                                               List of additional paths for pkg-config to search
                                                                                                                                                                                                                                                                                                    
  Backend options         Current Value                                                                                                                                                                                               Possible Values                                               Description
  ---------------         -------------                                                                                                                                                                                               ---------------                                               -----------
  backend_max_links       0                                                                                                                                                                                                           >=0                                                           Maximum number of linker processes to run or 0 for no limit
                                                                                                                                                                                                                                                                                                    
  Base options            Current Value                                                                                                                                                                                               Possible Values                                               Description
  ------------            -------------                                                                                                                                                                                               ---------------                                               -----------
  b_asneeded              true                                                                                                                                                                                                        [true, false]                                                 Use -Wl,--as-needed when linking
  b_colorout              always                                                                                                                                                                                                      [auto, always, never]                                         Use colored output
  b_coverage              false                                                                                                                                                                                                       [true, false]                                                 Enable coverage tracking.
  b_lto                   false                                                                                                                                                                                                       [true, false]                                                 Use link time optimization
  b_lundef                true                                                                                                                                                                                                        [true, false]                                                 Use -Wl,--no-undefined when linking
  b_ndebug                if-release                                                                                                                                                                                                  [true, false, if-release]                                     Disable asserts
  b_pch                   true                                                                                                                                                                                                        [true, false]                                                 Use precompiled headers
  b_pgo                   off                                                                                                                                                                                                         [off, generate, use]                                          Use profile guided optimization
  b_pie                   false                                                                                                                                                                                                       [true, false]                                                 Build executables as position independent
  b_sanitize              none                                                                                                                                                                                                        [none, address, thread, undefined, memory, address,undefined] Code sanitizer to use
  b_staticpic             true                                                                                                                                                                                                        [true, false]                                                 Build static libraries as position independent
                                                                                                                                                                                                                                                                                                    
  Compiler options        Current Value                                                                                                                                                                                               Possible Values                                               Description
  ----------------        -------------                                                                                                                                                                                               ---------------                                               -----------
  c_args                  []                                                                                                                                                                                                                                                                        Extra arguments passed to the c compiler
  c_link_args             []                                                                                                                                                                                                                                                                        Extra arguments passed to the c linker
  c_std                   c99                                                                                                                                                                                                         [none, c89, c99, c11, c17, c18, c2x, gnu89, gnu99, gnu11,     C language standard to use
                                                                                                                                                                                                                                       gnu17, gnu18, gnu2x]                                         
  cpp_args                []                                                                                                                                                                                                                                                                        Extra arguments passed to the cpp compiler
  cpp_debugstl            false                                                                                                                                                                                                       [true, false]                                                 STL debug mode
  cpp_eh                  default                                                                                                                                                                                                     [none, default, a, s, sc]                                     C++ exception handling type.
  cpp_link_args           []                                                                                                                                                                                                                                                                        Extra arguments passed to the cpp linker
  cpp_rtti                true                                                                                                                                                                                                        [true, false]                                                 Enable RTTI
  cpp_std                 c++14                                                                                                                                                                                                       [none, c++98, c++03, c++11, c++14, c++17, c++1z, c++2a,       C++ language standard to use
                                                                                                                                                                                                                                       gnu++03, gnu++11, gnu++14, gnu++17, gnu++1z, gnu++2a]        
                                                                                                                                                                                                                                                                                                    
  Directories             Current Value                                                                                                                                                                                               Possible Values                                               Description
  -----------             -------------                                                                                                                                                                                               ---------------                                               -----------
  bindir                  bin                                                                                                                                                                                                                                                                       Executable directory
  datadir                 share                                                                                                                                                                                                                                                                     Data file directory
  includedir              include                                                                                                                                                                                                                                                                   Header file directory
  infodir                 share/info                                                                                                                                                                                                                                                                Info page directory
  libdir                  lib                                                                                                                                                                                                                                                                       Library directory
  libexecdir              libexec                                                                                                                                                                                                                                                                   Library executable directory
  localedir               share/locale                                                                                                                                                                                                                                                              Locale data directory
  localstatedir           var                                                                                                                                                                                                                                                                       Localstate data directory
  mandir                  share/man                                                                                                                                                                                                                                                                 Manual page directory
  prefix                  /tmp/build_root/m64                                                                                                                                                                                                                                                       Installation prefix
  sbindir                 sbin                                                                                                                                                                                                                                                                      System executable directory
  sharedstatedir          com                                                                                                                                                                                                                                                                       Architecture-independent data directory
  sysconfdir              etc                                                                                                                                                                                                                                                                       Sysconf data directory
                                                                                                                                                                                                                                                                                                    
  Testing options         Current Value                                                                                                                                                                                               Possible Values                                               Description
  ---------------         -------------                                                                                                                                                                                               ---------------                                               -----------
  errorlogs               true                                                                                                                                                                                                        [true, false]                                                 Whether to print the logs from failing tests
  stdsplit                true                                                                                                                                                                                                        [true, false]                                                 Split stdout and stderr in test logs
                                                                                                                                                                                                                                                                                                    
  Project options         Current Value                                                                                                                                                                                               Possible Values                                               Description
  ---------------         -------------                                                                                                                                                                                               ---------------                                               -----------
  android-stub            false                                                                                                                                                                                                       [true, false]                                                 Build against android-stub
  build-aco-tests         false                                                                                                                                                                                                       [true, false]                                                 Build ACO tests. These require RADV and glslang but not an AMD GPU.
  build-tests             true                                                                                                                                                                                                        [true, false]                                                 Build unit tests. Currently this will build *all* unit tests except the ACO tests, which may build more than expected.
  d3d-drivers-path                                                                                                                                                                                                                                                                                  Location of D3D drivers. Default: $libdir/d3d
  draw-use-llvm           true                                                                                                                                                                                                        [true, false]                                                 Whether to use LLVM for the Gallium draw module, if LLVM is included.
  dri-drivers             [auto]                                                                                                                                                                                                      [auto, i915, i965, r100, r200, nouveau]                       List of dri drivers to build. If this is set to auto all drivers applicable to the target OS/architecture will be built
  dri-drivers-path                                                                                                                                                                                                                                                                                  Location to install dri drivers. Default: $libdir/dri.
  dri-search-path                                                                                                                                                                                                                                                                                   Locations to search for dri drivers, passed as colon separated list. Default: dri-drivers-path.
  dri3                    auto                                                                                                                                                                                                        [auto, true, false, disabled, enabled]                        enable support for dri3
  egl                     auto                                                                                                                                                                                                        [auto, true, false, enabled, disabled]                        Build support for EGL platform
  egl-lib-suffix                                                                                                                                                                                                                                                                                    Suffix to append to EGL library name.  Default: none.
  freedreno-kgsl          false                                                                                                                                                                                                       [true, false]                                                 use kgsl backend for freedreno vulkan driver
  gallium-drivers         [nouveau, v3d, vc4, panfrost, lima, etnaviv, tegra, zink, r600, swr, kmsro, swrast, virgl, auto, r300, radeonsi, iris, freedreno, svga]                                                                     [auto, kmsro, radeonsi, r300, r600, nouveau, freedreno,       List of gallium drivers to build. If this is set to auto all drivers applicable to the target OS/architecture will be built
                                                                                                                                                                                                                                       swrast, v3d, vc4, etnaviv, tegra, i915, svga, virgl, swr,    
                                                                                                                                                                                                                                       panfrost, iris, lima, zink, d3d12]                           
  gallium-extra-hud       false                                                                                                                                                                                                       [true, false]                                                 Enable HUD block/NIC I/O HUD status support
  gallium-nine            true                                                                                                                                                                                                        [true, false]                                                 build gallium "nine" Direct3D 9.x frontend.
  gallium-omx             bellagio                                                                                                                                                                                                    [auto, disabled, bellagio, tizonia]                           enable gallium omx frontend.
  gallium-opencl          standalone                                                                                                                                                                                                  [icd, standalone, disabled]                                   build gallium "clover" OpenCL frontend.
  gallium-va              true                                                                                                                                                                                                        [auto, true, false, enabled, disabled]                        enable gallium va frontend.
  gallium-vdpau           true                                                                                                                                                                                                        [auto, true, false, enabled, disabled]                        enable gallium vdpau frontend.
  gallium-xa              true                                                                                                                                                                                                        [auto, true, false, enabled, disabled]                        enable gallium xa frontend.
  gallium-xvmc            true                                                                                                                                                                                                        [auto, true, false, enabled, disabled]                        enable gallium xvmc frontend.
  gbm                     auto                                                                                                                                                                                                        [auto, true, false, enabled, disabled]                        Build support for gbm platform
  gles-lib-suffix                                                                                                                                                                                                                                                                                   Suffix to append to GLES library names.  Default: none.
  gles1                   auto                                                                                                                                                                                                        [auto, true, false, enabled, disabled]                        Build support for OpenGL ES 1.x
  gles2                   auto                                                                                                                                                                                                        [auto, true, false, enabled, disabled]                        Build support for OpenGL ES 2.x and 3.x
  glvnd                   false                                                                                                                                                                                                       [true, false]                                                 Enable GLVND support.
  glvnd-vendor-name       mesa                                                                                                                                                                                                                                                                      Vendor name string to use for glvnd libraries
  glx                     auto                                                                                                                                                                                                        [auto, disabled, dri, xlib, gallium-xlib]                     Build support for GLX platform
  glx-direct              true                                                                                                                                                                                                        [true, false]                                                 Enable direct rendering in GLX and EGL for DRI
  glx-read-only-text      false                                                                                                                                                                                                       [true, false]                                                 Disable writable .text section on x86 (decreases performance)
  install-intel-gpu-tests false                                                                                                                                                                                                       [true, false]                                                 Build and install Intel unit tests which require the GPU.  This option is for developers and the Intel CI system only.
  libunwind               auto                                                                                                                                                                                                        [auto, true, false, enabled, disabled]                        Use libunwind for stack-traces
  llvm                    auto                                                                                                                                                                                                        [auto, true, false, enabled, disabled]                        Build with LLVM support.
  lmsensors               auto                                                                                                                                                                                                        [auto, true, false, enabled, disabled]                        Enable HUD lmsensors support.
  microsoft-clc           auto                                                                                                                                                                                                        [enabled, disabled, auto]                                     Build support for the Microsoft CLC to DXIL compiler
  omx-libs-path                                                                                                                                                                                                                                                                                     path to put omx libraries. defaults to omx-bellagio pkg-config pluginsdir.
  opencl-native           true                                                                                                                                                                                                        [true, false]                                                 build gallium "clover" OpenCL frontend with native LLVM codegen support.
  opencl-spirv            false                                                                                                                                                                                                       [true, false]                                                 build gallium "clover" OpenCL frontend with SPIR-V binary support.
  opengl                  true                                                                                                                                                                                                        [true, false]                                                 Build support for OpenGL (all versions)
  osmesa                  false                                                                                                                                                                                                       [true, false]                                                 Build OSmesa.
  osmesa-bits             8                                                                                                                                                                                                           [8, 16, 32]                                                   Number of channel bits for OSMesa.
  platform-sdk-version    25                                                                                                                                                                                                          >=25, <=28                                                    Android Platform SDK version. Default: Nougat version.
  platforms               [auto]                                                                                                                                                                                                      [auto, x11, wayland, haiku, android, windows]                 window systems to support. If this is set to `auto`, all platforms applicable will be enabled.
  power8                  auto                                                                                                                                                                                                        [auto, true, false, enabled, disabled]                        Enable power8 optimizations.
  prefer-iris             true                                                                                                                                                                                                        [true, false]                                                 Prefer new Intel iris driver over older i965 driver
  selinux                 false                                                                                                                                                                                                       [true, false]                                                 Build an SELinux-aware Mesa
  shader-cache            auto                                                                                                                                                                                                        [auto, true, false, enabled, disabled]                        Build with on-disk shader cache support.
  shader-cache-default    true                                                                                                                                                                                                        [true, false]                                                 If set to false, the feature is only activated when environment variable MESA_GLSL_CACHE_DISABLE is set to false
  shader-cache-max-size                                                                                                                                                                                                                                                                             Default value for MESA_GLSL_CACHE_MAX_SIZE enviroment variable.
   If set, determines the maximum size of the on-disk cache of compiled
   GLSL programs, can be overriden by enviroment variable if needed. Should be set to a number optionally followed by
   ``K``, ``M``, or ``G`` to specify a size in kilobytes, megabytes, or
   gigabytes. By default, gigabytes will be assumed. And if unset, a
   maximum size of 1GB will be used.
  shared-glapi            auto                                                                                                                                                                                                        [auto, true, false, enabled, disabled]                        Whether to build a shared or static glapi. Defaults to false on Windows, true elsewhere
  shared-llvm             auto                                                                                                                                                                                                        [auto, true, false, enabled, disabled]                        Whether to link LLVM shared or statically.
  shared-swr              true                                                                                                                                                                                                        [true, false]                                                 Whether to link SWR shared or statically.
  spirv-to-dxil           false                                                                                                                                                                                                       [true, false]                                                 Build support for the SPIR-V to DXIL library
  sse2                    true                                                                                                                                                                                                        [true, false]                                                 use msse2 flag for mingw x86. Default: true
  static-libclc           []                                                                                                                                                                                                          [spirv, spirv64, all]                                         Link libclc SPIR-V statically.
  swr-arches              [avx, avx2]                                                                                                                                                                                                 [avx, avx2, knl, skx]                                         Architectures to build SWR support for.
  tools                   [all]                                                                                                                                                                                                       [drm-shim, etnaviv, freedreno, glsl, intel, intel-ui, nir,    List of tools to build. (Note: `intel-ui` selects `intel`)
                                                                                                                                                                                                                                       nouveau, xvmc, lima, panfrost, all]                          
  va-libs-path                                                                                                                                                                                                                                                                                      path to put va libraries. defaults to $libdir/dri.
  valgrind                auto                                                                                                                                                                                                        [auto, true, false, enabled, disabled]                        Build with valgrind support
  vdpau-libs-path                                                                                                                                                                                                                                                                                   path to put vdpau libraries. defaults to $libdir/vdpau.
  vulkan-drivers          [auto]                                                                                                                                                                                                      [auto, amd, broadcom, freedreno, intel, swrast,               List of vulkan drivers to build. If this is set to auto all drivers applicable to the target OS/architecture will be built
                                                                                                                                                                                                                                       virtio-experimental]                                         
  vulkan-icd-dir                                                                                                                                                                                                                                                                                    Location relative to prefix to put vulkan icds on install. Default: $datadir/vulkan/icd.d
  vulkan-layers           []                                                                                                                                                                                                          [device-select, intel-nullhw, overlay]                        List of vulkan layers to build
  xlib-lease              auto                                                                                                                                                                                                        [auto, true, false, enabled, disabled]                        Enable VK_EXT_acquire_xlib_display.
  xvmc-libs-path                                                                                                                                                                                                                                                                                    path to put xvmc libraries. defaults to $libdir.
  zlib                    enabled                                                                                                                                                                                                     [enabled, disabled, auto]                                     Use ZLIB to build driver. Default: enabled
  zstd                    auto                                                                                                                                                                                                        [auto, true, false, enabled, disabled]                        Use ZSTD instead of ZLIB in some cases.
 ninja -j 18 -C /home/jenkins/workspace/Leeroy_3/repos/mesa/build_mesa-buildtest_m64
ninja: Entering directory `/home/jenkins/workspace/Leeroy_3/repos/mesa/build_mesa-buildtest_m64'
[1/2837] Compiling C object src/util/libmesa_util.a.p/bitscan.c.o
[2/2837] Compiling C object src/libglsl_util.a.p/mesa_program_dummy_errors.c.o
[3/2837] Compiling C object src/util/libmesa_util.a.p/anon_file.c.o
[4/2837] Compiling C object src/libglsl_util.a.p/mesa_program_symbol_table.c.o
[5/2837] Compiling C object src/util/libmesa_util.a.p/blob.c.o
[6/2837] Compiling C object src/util/libmesa_util.a.p/build_id.c.o
[7/2837] Compiling C object src/util/libmesa_util.a.p/dag.c.o
[8/2837] Compiling C object src/util/libmesa_util.a.p/compress.c.o
[9/2837] Compiling C object src/util/libmesa_util.a.p/crc32.c.o
[10/2837] Compiling C object src/libglsl_util.a.p/mesa_program_prog_parameter.c.o
[11/2837] Compiling C object src/util/libmesa_util.a.p/double.c.o
[12/2837] Compiling C object src/util/libmesa_util.a.p/debug.c.o
[13/2837] Compiling C object src/util/libmesa_util.a.p/fossilize_db.c.o
[14/2837] Compiling C object src/util/libmesa_util.a.p/fast_idiv_by_const.c.o
[15/2837] Compiling C object src/util/libmesa_util.a.p/os_time.c.o
[16/2837] Compiling C object src/util/libmesa_util.a.p/memstream.c.o
[17/2837] Compiling C object src/util/libmesa_util.a.p/os_misc.c.o
[18/2837] Compiling C object src/libglsl_util.a.p/mesa_main_extensions_table.c.o
[19/2837] Compiling C++ object src/gtest/libgtest.a.p/src_gtest_main.cc.o
[20/2837] Compiling C object src/util/libmesa_util.a.p/disk_cache.c.o
[21/2837] Compiling C object src/util/libmesa_util.a.p/hash_table.c.o
[22/2837] Compiling C object src/util/libmesa_util.a.p/log.c.o
[23/2837] Compiling C object src/util/libmesa_util.a.p/disk_cache_os.c.o
[24/2837] Compiling C object src/util/libmesa_util.a.p/u_idalloc.c.o
[25/2837] Compiling C object src/util/libmesa_util.a.p/mesa-sha1.c.o
[26/2837] Compiling C object src/util/libmesa_util.a.p/sha1_sha1.c.o
[27/2837] Compiling C object src/util/libmesa_util.a.p/half_float.c.o
[28/2837] Compiling C object src/util/libmesa_util.a.p/os_socket.c.o
[29/2837] Compiling C object src/util/libmesa_util.a.p/os_file.c.o
[30/2837] Linking static target src/libglsl_util.a
[31/2837] Compiling C object src/util/libmesa_util.a.p/rand_xor.c.o
[32/2837] Compiling C object src/util/libmesa_util.a.p/ralloc.c.o
[33/2837] Compiling C object src/util/libmesa_util.a.p/u_process.c.o
[34/2837] Compiling C object src/util/libmesa_util.a.p/set.c.o
[35/2837] Compiling C object src/util/libmesa_util.a.p/rb_tree.c.o
[36/2837] Compiling C object src/util/libmesa_util.a.p/rgtc.c.o
[37/2837] Compiling C object src/util/libmesa_util.a.p/u_atomic.c.o
[38/2837] Compiling C object src/util/libmesa_util.a.p/slab.c.o
[39/2837] Compiling C object src/util/libmesa_util.a.p/strtod.c.o
[40/2837] Compiling C object src/util/libmesa_util.a.p/string_buffer.c.o
[41/2837] Compiling C object src/util/libmesa_util.a.p/sparse_array.c.o
[42/2837] Compiling C object src/util/libmesa_util.a.p/softfloat.c.o
[43/2837] Compiling C object src/util/libmesa_util.a.p/register_allocate.c.o
[44/2837] Compiling C object src/util/libmesa_util.a.p/u_vector.c.o
[45/2837] Compiling C object src/util/libmesa_util.a.p/u_mm.c.o
[46/2837] Compiling C object src/util/libmesa_util.a.p/u_math.c.o
[47/2837] Compiling C object src/util/libmesa_util.a.p/u_queue.c.o
[48/2837] Compiling C object src/util/libmesa_util.a.p/u_debug.c.o
[49/2837] Compiling C object src/util/libmesa_util.a.p/u_debug_memory.c.o
[50/2837] Compiling C object src/util/libmesa_util.a.p/vma.c.o
[51/2837] Compiling C object src/util/libmesa_util.a.p/u_cpu_detect.c.o
[52/2837] Compiling C object src/util/u_atomic_test.p/u_atomic_test.c.o
[53/2837] Compiling C object src/util/libmesa_util.a.p/u_debug_stack.c.o
[54/2837] Compiling C object src/util/libmesa_util.a.p/u_debug_symbol.c.o
[55/2837] Compiling C++ object src/util/libmesa_util.a.p/u_printf.cpp.o
[56/2837] Compiling C object src/util/blob_test.p/blob_test.c.o
[57/2837] Compiling C object src/util/rb_tree_test.p/rb_tree_test.c.o
[58/2837] Compiling C object src/util/roundeven_test.p/roundeven_test.c.o
[59/2837] Compiling C object src/util/process_test.p/process_test.c.o
[60/2837] Compiling C object src/util/mesa-sha1_test.p/mesa-sha1_test.c.o
[61/2837] Compiling C++ object src/gtest/libgtest.a.p/src_gtest-all.cc.o
[62/2837] Compiling C object src/util/tests/cache/cache_test.p/cache_test.c.o
[63/2837] Compiling C object src/util/tests/sparse_array/multi_threaded.p/multi_threaded.c.o
[64/2837] Compiling C object src/util/tests/hash_table/clear_test.p/clear.c.o
[65/2837] Compiling C object src/util/tests/hash_table/collision_test.p/collision.c.o
[66/2837] Compiling C object src/util/tests/hash_table/delete_and_lookup_test.p/delete_and_lookup.c.o
[67/2837] Compiling C object src/util/tests/hash_table/delete_management_test.p/delete_management.c.o
[68/2837] Compiling C object src/util/tests/hash_table/destroy_callback_test.p/destroy_callback.c.o
[69/2837] Compiling C object src/util/tests/hash_table/insert_and_lookup_test.p/insert_and_lookup.c.o
[70/2837] Compiling C object src/util/tests/hash_table/insert_many_test.p/insert_many.c.o
[71/2837] Compiling C++ object src/util/bitset_test.p/bitset_test.cpp.o
[72/2837] Compiling C++ object src/util/u_debug_stack_test.p/u_debug_stack_test.cpp.o
[73/2837] Compiling C++ object src/util/xmlconfig_test.p/tests_xmlconfig.cpp.o
[74/2837] Compiling C object src/util/tests/hash_table/null_destroy_test.p/null_destroy.c.o
[75/2837] Compiling C object src/util/tests/hash_table/random_entry_test.p/random_entry.c.o
[76/2837] Compiling C object src/util/tests/hash_table/remove_key_test.p/remove_key.c.o
[77/2837] Compiling C++ object src/util/tests/fast_urem_by_const/fast_urem_by_const_test.p/fast_urem_by_const_test.cpp.o
[78/2837] Compiling C++ object src/util/tests/set/set_test.p/set_test.cpp.o
[79/2837] Compiling C object src/util/tests/hash_table/remove_null_test.p/remove_null.c.o
[80/2837] Compiling C++ object src/util/tests/fast_idiv_by_const/fast_idiv_by_const_test.p/fast_idiv_by_const_test.cpp.o
[81/2837] Compiling C object src/util/tests/hash_table/replacement_test.p/replacement.c.o
[82/2837] Compiling C object src/util/tests/format/srgb.p/srgb.c.o
[83/2837] Generating git_sha1.h with a custom command
[84/2837] Compiling C object src/util/tests/format/u_format_compatible_test.p/u_format_compatible_test.c.o
[85/2837] Compiling C++ object src/util/tests/vma/vma_random_test.p/vma_random_test.cpp.o
[86/2837] Linking target src/util/roundeven_test
[87/2837] Compiling C++ object src/util/tests/vector/vector_test.p/vector_test.cpp.o
[88/2837] Compiling C++ object src/util/tests/string_buffer/string_buffer_test.p/string_buffer_test.cpp.o
[89/2837] Compiling C object src/util/tests/format/u_format_test.p/u_format_test.c.o
[90/2837] Compiling C++ object src/util/tests/timespec/timespec_test.p/timespec_test.cpp.o
[91/2837] Linking static target src/gtest/libgtest.a
[92/2837] Generating driconf_static.h with a custom command
[93/2837] Compiling C object src/util/libxmlconfig.a.p/xmlconfig.c.o
[94/2837] Linking static target src/util/libxmlconfig.a
[95/2837] Generating u_format_pack.h with a custom command (wrapped by meson to capture output)
[96/2837] Compiling C object src/util/format/libmesa_format.a.p/u_format.c.o
[97/2837] Compiling C object src/util/format/libmesa_format.a.p/u_format_latc.c.o
[98/2837] Compiling C object src/util/format/libmesa_format.a.p/u_format_other.c.o
[99/2837] Compiling C object src/util/format/libmesa_format.a.p/u_format_etc.c.o
[100/2837] Generating u_format_table.c with a custom command (wrapped by meson to capture output)
[101/2837] Compiling C object src/util/format/libmesa_format.a.p/u_format_fxt1.c.o
[102/2837] Compiling C object src/util/format/libmesa_format.a.p/u_format_bptc.c.o
[103/2837] Compiling C object src/util/format/libmesa_format.a.p/u_format_rgtc.c.o
[104/2837] Compiling C object src/util/format/libmesa_format.a.p/u_format_s3tc.c.o
[105/2837] Compiling C object src/util/format/libmesa_format.a.p/u_format_tests.c.o
[106/2837] Compiling C object src/util/format/libmesa_format.a.p/u_format_yuv.c.o
[107/2837] Compiling C object src/util/format/libmesa_format.a.p/u_format_zs.c.o
[108/2837] Generating es1_glapi_mapi_tmp.h with a custom command (wrapped by meson to capture output)
[109/2837] Compiling C object src/mapi/es1api/libGLESv1_CM.so.1.1.0.p/.._entry.c.o
[110/2837] Generating enums.c with a custom command (wrapped by meson to capture output)
[111/2837] Compiling C object src/util/format/libmesa_format.a.p/meson-generated_.._u_format_table.c.o
[112/2837] Linking static target src/util/format/libmesa_format.a
[113/2837] Generating marshal_generated1.c with a custom command (wrapped by meson to capture output)
[114/2837] Generating indirect.c with a custom command (wrapped by meson to capture output)
[115/2837] Generating glapitable.h with a custom command (wrapped by meson to capture output)
[116/2837] Generating indirect.h with a custom command (wrapped by meson to capture output)
[117/2837] Generating marshal_generated6.c with a custom command (wrapped by meson to capture output)
[118/2837] Generating marshal_generated3.c with a custom command (wrapped by meson to capture output)
[119/2837] Generating marshal_generated7.c with a custom command (wrapped by meson to capture output)
[120/2837] Generating marshal_generated4.c with a custom command (wrapped by meson to capture output)
[121/2837] Generating vtn_gather_types.c with a custom command
[122/2837] Generating indirect_size.c with a custom command (wrapped by meson to capture output)
[123/2837] Compiling C++ object src/mapi/shared-glapi/shared-glapi-test.p/tests_check_table.cpp.o
[124/2837] Generating api_exec.c with a custom command (wrapped by meson to capture output)
[125/2837] Generating vtn_generator_ids.h with a custom command
[126/2837] Generating spirv_info.c with a custom command
[127/2837] Generating marshal_generated0.c with a custom command (wrapped by meson to capture output)
[128/2837] Generating marshal_generated2.c with a custom command (wrapped by meson to capture output)
[129/2837] Generating glcpp-lex.c with a custom command
[130/2837] Compiling C object src/compiler/glsl/glcpp/libglcpp_standalone.a.p/pp_standalone_scaffolding.c.o
[131/2837] Generating nir_intrinsics.h with a custom command
[132/2837] Linking static target src/compiler/glsl/glcpp/libglcpp_standalone.a
[133/2837] Compiling C object src/compiler/glsl/glcpp/glcpp.p/glcpp.c.o
[134/2837] Generating glsl_lexer_cpp with a custom command
[135/2837] Generating nir_intrinsic.c with a custom command
[136/2837] Generating nir_intrinsics_indices.h with a custom command
[137/2837] Generating nir_builder_opcodes.h with a custom command (wrapped by meson to capture output)
[138/2837] Compiling C++ object src/compiler/glsl/glsl_compiler.p/main.cpp.o
[139/2837] Generating nir_opcodes.h with a custom command (wrapped by meson to capture output)
[140/2837] Generating glcpp-parse.[ch] with a custom command
[141/2837] Compiling C object src/drm-shim/libdrm_shim.a.p/device.c.o
[142/2837] Generating ir_expression_operation.h with a custom command (wrapped by meson to capture output)
[143/2837] Generating es2_glapi_mapi_tmp.h with a custom command (wrapped by meson to capture output)
[144/2837] Generating float64_glsl.h with a custom command
[145/2837] Compiling C object src/mapi/es2api/libGLESv2.so.2.0.0.p/.._entry.c.o
[146/2837] Generating glapi_mapi_tmp.h with a custom command (wrapped by meson to capture output)
[147/2837] Compiling C object src/compiler/libcompiler.a.p/shader_enums.c.o
[148/2837] Compiling C object src/compiler/nir/libnir.a.p/meson-generated_.._.._spirv_spirv_info.c.o
[149/2837] Compiling C object src/compiler/nir/libnir.a.p/nir_gather_info.c.o
[150/2837] Compiling C object src/mapi/glapi/libglapi_static.a.p/.._entry.c.o
[151/2837] Linking static target src/mapi/glapi/libglapi_static.a
[152/2837] Compiling C object src/compiler/nir/libnir.a.p/nir_gather_ssa_types.c.o
[153/2837] Compiling C object src/compiler/nir/libnir.a.p/nir_dominance.c.o
[154/2837] Compiling C object src/compiler/nir/libnir.a.p/nir_builtin_builder.c.o
[155/2837] Compiling C object src/compiler/nir/libnir.a.p/nir_clone.c.o
[156/2837] Generating nir_opcodes.c with a custom command (wrapped by meson to capture output)
[157/2837] Compiling C object src/compiler/nir/libnir.a.p/meson-generated_.._.._spirv_vtn_gather_types.c.o
[158/2837] Compiling C object src/compiler/nir/libnir.a.p/meson-generated_.._nir_intrinsics.c.o
[159/2837] Compiling C object src/compiler/nir/libnir.a.p/meson-generated_.._nir_opcodes.c.o
[160/2837] Generating nir_constant_expressions.c with a custom command (wrapped by meson to capture output)
[161/2837] Compiling C object src/compiler/nir/libnir.a.p/nir_control_flow.c.o
[162/2837] Compiling C object src/compiler/nir/libnir.a.p/nir.c.o
[163/2837] Compiling C object src/compiler/nir/libnir.a.p/nir_convert_ycbcr.c.o
[164/2837] Compiling C object src/compiler/nir/libnir.a.p/nir_divergence_analysis.c.o
[165/2837] Compiling C object src/compiler/nir/libnir.a.p/meson-generated_.._nir_constant_expressions.c.o
[166/2837] Compiling C object src/compiler/nir/libnir.a.p/nir_deref.c.o
[167/2837] Compiling C object src/compiler/nir/libnir.a.p/nir_from_ssa.c.o
[168/2837] Compiling C object src/compiler/nir/libnir.a.p/nir_lower_amul.c.o
[169/2837] Compiling C object src/compiler/nir/libnir.a.p/nir_loop_analyze.c.o
[170/2837] Compiling C object src/compiler/nir/libnir.a.p/nir_lower_alu_to_scalar.c.o
[171/2837] Compiling C object src/compiler/nir/libnir.a.p/nir_gather_xfb_info.c.o
[172/2837] Compiling C object src/compiler/nir/libnir.a.p/nir_gs_count_vertices.c.o
[173/2837] Compiling C object src/compiler/nir/libnir.a.p/nir_inline_functions.c.o
[174/2837] Compiling C object src/compiler/nir/libnir.a.p/nir_instr_set.c.o
[175/2837] Compiling C object src/compiler/nir/libnir.a.p/nir_inline_uniforms.c.o
[176/2837] Compiling C object src/compiler/nir/libnir.a.p/nir_lower_frexp.c.o
[177/2837] Compiling C object src/compiler/nir/libnir.a.p/nir_liveness.c.o
[178/2837] Compiling C object src/compiler/nir/libnir.a.p/nir_lower_alu.c.o
[179/2837] Compiling C object src/compiler/nir/libnir.a.p/nir_lower_bitmap.c.o
[180/2837] Compiling C object src/compiler/nir/libnir.a.p/nir_lower_alpha_test.c.o
[181/2837] Compiling C object src/compiler/nir/libnir.a.p/nir_lower_bool_to_bitsize.c.o
[182/2837] Compiling C object src/compiler/nir/libnir.a.p/nir_lower_bool_to_float.c.o
[183/2837] Compiling C++ object src/compiler/glsl/libglsl_standalone.a.p/ir_builder_print_visitor.cpp.o
[184/2837] Compiling C object src/compiler/nir/libnir.a.p/nir_lower_cl_images_to_tex.c.o
[185/2837] Compiling C++ object src/compiler/glsl/libglsl_standalone.a.p/standalone_scaffolding.cpp.o
[186/2837] Compiling C++ object src/compiler/libcompiler.a.p/nir_types.cpp.o
[187/2837] Compiling C object src/compiler/nir/libnir.a.p/nir_lower_variable_initializers.c.o
[188/2837] Compiling C object src/compiler/nir/libnir.a.p/nir_lower_clamp_color_outputs.c.o
[189/2837] Compiling C object src/compiler/nir/libnir.a.p/nir_lower_discard_or_demote.c.o
[190/2837] Compiling C object src/compiler/nir/libnir.a.p/nir_lower_clip_halfz.c.o
[191/2837] Compiling C object src/compiler/nir/libnir.a.p/nir_lower_bool_to_int32.c.o
[192/2837] Compiling C object src/compiler/nir/libnir.a.p/nir_lower_clip.c.o
[193/2837] Compiling C object src/compiler/nir/libnir.a.p/nir_lower_array_deref_of_vec.c.o
[194/2837] Compiling C object src/compiler/nir/libnir.a.p/nir_lower_atomics_to_ssbo.c.o
[195/2837] Compiling C object src/compiler/nir/libnir.a.p/nir_lower_global_vars_to_local.c.o
[196/2837] Compiling C object src/compiler/nir/libnir.a.p/nir_lower_clip_cull_distance_arrays.c.o
[197/2837] Compiling C object src/compiler/nir/libnir.a.p/nir_lower_clip_disable.c.o
[198/2837] Compiling C object src/compiler/nir/libnir.a.p/nir_lower_convert_alu_types.c.o
[199/2837] Compiling C object src/compiler/nir/libnir.a.p/nir_lower_fragcolor.c.o
[200/2837] Compiling C object src/compiler/nir/libnir.a.p/nir_lower_goto_ifs.c.o
[201/2837] Compiling C object src/compiler/nir/libnir.a.p/nir_lower_fp16_conv.c.o
[202/2837] Compiling C object src/compiler/nir/libnir.a.p/nir_lower_drawpixels.c.o
[203/2837] Generating marshal_generated5.c with a custom command (wrapped by meson to capture output)
[204/2837] Compiling C object src/compiler/nir/libnir.a.p/nir_lower_double_ops.c.o
[205/2837] Compiling C object src/compiler/nir/libnir.a.p/nir_lower_fb_read.c.o
[206/2837] Compiling C object src/compiler/nir/libnir.a.p/nir_lower_flatshade.c.o
[207/2837] Compiling C object src/compiler/nir/libnir.a.p/nir_lower_flrp.c.o
[208/2837] Compiling C object src/compiler/nir/libnir.a.p/nir_lower_fragcoord_wtrans.c.o
[209/2837] Compiling C object src/compiler/nir/libnir.a.p/nir_lower_load_const_to_scalar.c.o
[210/2837] Compiling C object src/compiler/nir/libnir.a.p/nir_lower_io_to_temporaries.c.o
[211/2837] Compiling C object src/compiler/nir/libnir.a.p/nir_lower_gs_intrinsics.c.o
[212/2837] Compiling C object src/compiler/nir/libnir.a.p/nir_lower_locals_to_regs.c.o
[213/2837] Compiling C object src/compiler/nir/libnir.a.p/nir_lower_indirect_derefs.c.o
[214/2837] Compiling C++ object src/compiler/libcompiler.a.p/glsl_types.cpp.o
[215/2837] Compiling C object src/compiler/nir/libnir.a.p/nir_lower_idiv.c.o
[216/2837] Generating ir_expression_operation_constant.h with a custom command (wrapped by meson to capture output)
[217/2837] Compiling C object src/compiler/nir/libnir.a.p/nir_lower_input_attachments.c.o
[218/2837] Compiling C object src/compiler/nir/libnir.a.p/nir_lower_interpolation.c.o
[219/2837] Linking static target src/compiler/libcompiler.a
[220/2837] Compiling C object src/compiler/nir/libnir.a.p/nir_lower_int64.c.o
[221/2837] Compiling C object src/compiler/nir/libnir.a.p/nir_lower_int_to_float.c.o
[222/2837] Compiling C object src/compiler/nir/libnir.a.p/nir_lower_io_arrays_to_elements.c.o
[223/2837] Compiling C object src/compiler/nir/libnir.a.p/nir_lower_io.c.o
[224/2837] Compiling C object src/compiler/nir/libnir.a.p/nir_lower_io_to_scalar.c.o
[225/2837] Compiling C object src/compiler/nir/libnir.a.p/nir_lower_non_uniform_access.c.o
[226/2837] Compiling C object src/compiler/nir/libnir.a.p/nir_lower_packing.c.o
[227/2837] Compiling C object src/compiler/nir/libnir.a.p/nir_lower_memory_model.c.o
[228/2837] Compiling C object src/compiler/nir/libnir.a.p/nir_lower_memcpy.c.o
[229/2837] Compiling C object src/compiler/nir/libnir.a.p/nir_lower_io_to_vector.c.o
[230/2837] Compiling C object src/compiler/nir/libnir.a.p/nir_lower_multiview.c.o
[231/2837] Compiling C object src/compiler/nir/libnir.a.p/nir_lower_mediump.c.o
[232/2837] Compiling C object src/compiler/nir/libnir.a.p/nir_lower_pntc_ytransform.c.o
[233/2837] Compiling C object src/compiler/nir/libnir.a.p/nir_lower_point_size.c.o
[234/2837] Compiling C object src/compiler/nir/libnir.a.p/nir_lower_phis_to_scalar.c.o
[235/2837] Compiling C object src/compiler/nir/libnir.a.p/nir_lower_patch_vertices.c.o
[236/2837] Compiling C object src/compiler/nir/libnir.a.p/nir_lower_passthrough_edgeflags.c.o
[237/2837] Compiling C object src/compiler/nir/libnir.a.p/nir_lower_subgroups.c.o
[238/2837] Compiling C object src/compiler/nir/libnir.a.p/nir_lower_point_size_mov.c.o
[239/2837] Compiling C object src/compiler/nir/libnir.a.p/nir_lower_system_values.c.o
[240/2837] Compiling C object src/compiler/nir/libnir.a.p/nir_lower_scratch.c.o
[241/2837] Compiling C object src/compiler/nir/libnir.a.p/nir_lower_printf.c.o
[242/2837] Compiling C object src/compiler/nir/libnir.a.p/nir_lower_regs_to_ssa.c.o
[243/2837] Compiling C object src/compiler/nir/libnir.a.p/nir_lower_returns.c.o
[244/2837] Compiling C object src/compiler/nir/libnir.a.p/nir_lower_samplers.c.o
[245/2837] Compiling C object src/compiler/nir/libnir.a.p/nir_lower_ssbo.c.o
[246/2837] Compiling C object src/compiler/nir/libnir.a.p/nir_lower_two_sided_color.c.o
[247/2837] Compiling C object src/compiler/nir/libnir.a.p/nir_lower_to_source_mods.c.o
[248/2837] Compiling C object src/compiler/nir/libnir.a.p/nir_metadata.c.o
[249/2837] Compiling C object src/compiler/nir/libnir.a.p/nir_lower_undef_to_zero.c.o
[250/2837] Compiling C object src/compiler/nir/libnir.a.p/nir_lower_texcoord_replace.c.o
[251/2837] Compiling C object src/compiler/nir/libnir.a.p/nir_move_vec_src_uses_to_dest.c.o
[252/2837] Compiling C object src/compiler/nir/libnir.a.p/nir_lower_tex.c.o
[253/2837] Compiling C object src/compiler/nir/libnir.a.p/nir_lower_vars_to_ssa.c.o
[254/2837] Compiling C object src/compiler/nir/libnir.a.p/nir_lower_ubo_vec4.c.o
[255/2837] Compiling C object src/compiler/nir/libnir.a.p/nir_lower_vec3_to_vec4.c.o
[256/2837] Compiling C object src/compiler/nir/libnir.a.p/nir_lower_var_copies.c.o
[257/2837] Compiling C object src/compiler/nir/libnir.a.p/nir_lower_vec_to_movs.c.o
[258/2837] Compiling C object src/compiler/nir/libnir.a.p/nir_lower_viewport_transform.c.o
[259/2837] Compiling C object src/compiler/nir/libnir.a.p/nir_lower_wpos_center.c.o
[260/2837] Compiling C object src/compiler/nir/libnir.a.p/nir_lower_wpos_ytransform.c.o
[261/2837] Compiling C object src/compiler/nir/libnir.a.p/nir_lower_wrmasks.c.o
[262/2837] Compiling C object src/compiler/nir/libnir.a.p/nir_lower_bit_size.c.o
[263/2837] Compiling C object src/compiler/nir/libnir.a.p/nir_lower_uniforms_to_ubo.c.o
[264/2837] Compiling C object src/compiler/nir/libnir.a.p/nir_opt_access.c.o
[265/2837] Compiling C object src/compiler/nir/libnir.a.p/nir_opt_barriers.c.o
[266/2837] Compiling C object src/compiler/nir/libnir.a.p/nir_opt_combine_stores.c.o
[267/2837] Compiling C object src/compiler/nir/libnir.a.p/nir_normalize_cubemap_coords.c.o
[268/2837] Compiling C object src/compiler/nir/libnir.a.p/nir_opt_copy_prop_vars.c.o
[269/2837] Compiling C object src/compiler/nir/libnir.a.p/nir_opt_conditional_discard.c.o
[270/2837] Compiling C object src/compiler/nir/libnir.a.p/nir_opt_constant_folding.c.o
[271/2837] Compiling C object src/compiler/nir/libnir.a.p/nir_opt_comparison_pre.c.o
[272/2837] Generating indirect_init.c with a custom command (wrapped by meson to capture output)
[273/2837] Compiling C object src/compiler/nir/libnir.a.p/nir_opt_cse.c.o
[274/2837] Compiling C object src/compiler/nir/libnir.a.p/nir_opt_dce.c.o
[275/2837] Compiling C object src/compiler/nir/libnir.a.p/nir_opt_dead_cf.c.o
[276/2837] Compiling C object src/compiler/nir/libnir.a.p/nir_opt_idiv_const.c.o
[277/2837] Compiling C object src/compiler/nir/libnir.a.p/nir_opt_if.c.o
[278/2837] Compiling C object src/compiler/nir/libnir.a.p/nir_opt_gcm.c.o
[279/2837] Compiling C object src/compiler/nir/libnir.a.p/nir_opt_copy_propagate.c.o
[280/2837] Compiling C object src/compiler/nir/libnir.a.p/nir_opt_find_array_copies.c.o
[281/2837] Compiling C object src/compiler/nir/libnir.a.p/nir_opt_move.c.o
[282/2837] Compiling C object src/compiler/nir/libnir.a.p/nir_linking_helpers.c.o
[283/2837] Compiling C object src/compiler/nir/libnir.a.p/nir_opt_dead_write_vars.c.o
[284/2837] Compiling C object src/compiler/nir/libnir.a.p/nir_opt_intrinsics.c.o
[285/2837] Compiling C object src/compiler/nir/libnir.a.p/nir_sweep.c.o
[286/2837] Compiling C object src/compiler/nir/libnir.a.p/nir_opt_large_constants.c.o
[287/2837] Compiling C object src/compiler/nir/libnir.a.p/nir_opt_load_store_vectorize.c.o
[288/2837] Compiling C object src/compiler/nir/libnir.a.p/nir_opt_loop_unroll.c.o
[289/2837] Compiling C object src/compiler/nir/libnir.a.p/nir_opt_offsets.c.o
[290/2837] Compiling C object src/compiler/nir/libnir.a.p/nir_opt_memcpy.c.o
[291/2837] Compiling C object src/compiler/nir/libnir.a.p/nir_split_per_member_structs.c.o
[292/2837] Compiling C object src/compiler/nir/libnir.a.p/nir_split_vars.c.o
[293/2837] Compiling C object src/compiler/nir/libnir.a.p/nir_opt_peephole_select.c.o
[294/2837] Compiling C object src/compiler/nir/libnir.a.p/nir_opt_rematerialize_compares.c.o
[295/2837] Compiling C object src/compiler/nir/libnir.a.p/nir_opt_sink.c.o
[296/2837] Compiling C object src/compiler/nir/libnir.a.p/nir_opt_trivial_continues.c.o
[297/2837] Compiling C object src/compiler/nir/libnir.a.p/nir_opt_remove_phis.c.o
[298/2837] Compiling C object src/compiler/nir/libnir.a.p/nir_opt_undef.c.o
[299/2837] Compiling C object src/compiler/nir/libnir.a.p/nir_phi_builder.c.o
[300/2837] Compiling C object src/compiler/nir/libnir.a.p/nir_opt_shrink_vectors.c.o
[301/2837] Compiling C object src/compiler/nir/libnir.a.p/nir_propagate_invariant.c.o
[302/2837] Compiling C object src/compiler/nir/libnir.a.p/nir_opt_vectorize.c.o
[303/2837] Compiling C object src/compiler/nir/libnir.a.p/nir_range_analysis.c.o
[304/2837] Compiling C object src/compiler/nir/libnir.a.p/nir_opt_uniform_atomics.c.o
[305/2837] Compiling C object src/compiler/nir/libnir.a.p/nir_remove_dead_variables.c.o
[306/2837] Compiling C object src/compiler/nir/libnir.a.p/nir_repair_ssa.c.o
[307/2837] Compiling C object src/compiler/nir/libnir.a.p/nir_schedule.c.o
[308/2837] Compiling C object src/compiler/nir/libnir.a.p/nir_print.c.o
[309/2837] Compiling C object src/compiler/nir/libnir.a.p/nir_serialize.c.o
[310/2837] Compiling C object src/compiler/nir/libnir.a.p/nir_to_lcssa.c.o
[311/2837] Compiling C object src/compiler/nir/libnir.a.p/nir_search.c.o
[312/2837] Compiling C object src/compiler/nir/libnir.a.p/nir_worklist.c.o
[313/2837] Compiling C object src/compiler/nir/libnir.a.p/.._spirv_nir_load_libclc.c.o
[314/2837] Compiling C object src/compiler/nir/libnir.a.p/nir_validate.c.o
[315/2837] Compiling C object src/compiler/nir/libnir.a.p/nir_split_var_copies.c.o
[316/2837] Compiling C object src/compiler/nir/libnir.a.p/.._spirv_nir_lower_libclc.c.o
[317/2837] Compiling C object src/compiler/nir/libnir.a.p/.._spirv_gl_spirv.c.o
[318/2837] Generating ir_expression_operation_strings.h with a custom command (wrapped by meson to capture output)
[319/2837] Compiling C object src/compiler/nir/libnir.a.p/.._spirv_vtn_subgroup.c.o
[320/2837] Compiling C object src/compiler/nir/libnir.a.p/.._spirv_vtn_alu.c.o
[321/2837] Compiling C object src/compiler/nir/libnir.a.p/.._spirv_spirv_to_nir.c.o
[322/2837] Compiling C object src/compiler/nir/libnir.a.p/.._spirv_vtn_opencl.c.o
[323/2837] Compiling C object src/compiler/nir/libnir.a.p/.._spirv_vtn_cfg.c.o
[324/2837] Compiling C object src/compiler/nir/libnir.a.p/.._spirv_vtn_amd.c.o
[325/2837] Compiling C object src/compiler/nir/libnir.a.p/.._spirv_vtn_variables.c.o
[326/2837] Compiling C object src/compiler/nir/libnir.a.p/.._spirv_vtn_glsl450.c.o
[327/2837] Compiling C object src/compiler/spirv2nir.p/spirv_spirv2nir.c.o
[328/2837] Compiling C++ object src/compiler/nir/nir_builder_test.p/tests_builder_tests.cpp.o
[329/2837] Compiling C object src/compiler/glsl/glcpp/libglcpp.a.p/meson-generated_.._glcpp-lex.c.o
[330/2837] Compiling C++ object src/compiler/nir/nir_control_flow_test.p/tests_control_flow_tests.cpp.o
[331/2837] Compiling C++ object src/compiler/avail_vis.p/spirv_tests_avail_vis.cpp.o
[332/2837] Compiling C++ object src/compiler/nir/comparison_pre.p/tests_comparison_pre_tests.cpp.o
[333/2837] Compiling C++ object src/compiler/nir/nir_opt_if_tests.p/tests_opt_if_tests.cpp.o
[334/2837] Compiling C++ object src/compiler/nir/negative_equal.p/tests_negative_equal_tests.cpp.o
[335/2837] Compiling C++ object src/compiler/glsl/glsl_test.p/test.cpp.o
[336/2837] Compiling C++ object src/compiler/volatile.p/spirv_tests_volatile.cpp.o
[337/2837] Compiling C++ object src/compiler/nir/nir_lower_returns_tests.p/tests_lower_returns_tests.cpp.o
[338/2837] Compiling C++ object src/compiler/nir/ssa_def_bits_used.p/tests_ssa_def_bits_used_tests.cpp.o
[339/2837] Compiling C++ object src/compiler/nir/nir_serialize_test.p/tests_serialize_tests.cpp.o
[340/2837] Compiling C object src/compiler/glsl/glcpp/libglcpp.a.p/pp.c.o
[341/2837] Compiling C object src/compiler/glsl/glcpp/libglcpp.a.p/meson-generated_.._glcpp-parse.c.o
[342/2837] Compiling C++ object src/compiler/nir/nir_vars_test.p/tests_vars_tests.cpp.o
[343/2837] Linking static target src/compiler/glsl/glcpp/libglcpp.a
[344/2837] Compiling C++ object src/compiler/glsl/libglsl_standalone.a.p/standalone.cpp.o
[345/2837] Compiling C++ object src/compiler/glsl/glsl_test.p/test_optpass.cpp.o
[346/2837] Linking static target src/compiler/glsl/libglsl_standalone.a
[347/2837] Compiling C++ object src/compiler/glsl/tests/general_ir_test.p/array_refcount_test.cpp.o
[348/2837] Compiling C++ object src/compiler/glsl/tests/general_ir_test.p/opt_add_neg_to_sub_test.cpp.o
[349/2837] Compiling C++ object src/compiler/glsl/tests/general_ir_test.p/varyings_test.cpp.o
[350/2837] Compiling C++ object src/compiler/nir/load_store_vectorizer.p/tests_load_store_vectorizer_tests.cpp.o
[351/2837] Compiling C++ object src/compiler/glsl/tests/general_ir_test.p/invalidate_locations_test.cpp.o
[352/2837] Compiling C++ object src/compiler/glsl/tests/general_ir_test.p/lower_int64_test.cpp.o
[353/2837] Compiling C++ object src/compiler/glsl/tests/general_ir_test.p/builtin_variable_test.cpp.o
[354/2837] Generating wayland-drm-protocol.c with a custom command
[355/2837] Compiling C++ object src/compiler/glsl/tests/general_ir_test.p/general_ir_test.cpp.o
[356/2837] Compiling C++ object src/compiler/glsl/tests/uniform_initializer_test.p/copy_constant_to_storage_tests.cpp.o
[357/2837] Generating glsl_parser with a custom command
[358/2837] Compiling C object src/drm-shim/libdrm_shim.a.p/drm_shim.c.o
[359/2837] Generating wayland-drm-client-protocol.h with a custom command
[360/2837] Compiling C++ object src/imgui/libimgui_core.a.p/imgui_widgets.cpp.o
[361/2837] Generating wayland-drm-server-protocol.h with a custom command
[362/2837] Generating linux-dmabuf-unstable-v1-protocol.c with a custom command
[363/2837] Compiling C++ object src/compiler/glsl/tests/list_iterators.p/list_iterators.cpp.o
[364/2837] Compiling C++ object src/compiler/glsl/tests/uniform_initializer_test.p/uniform_initializer_utils.cpp.o
[365/2837] Generating linux-dmabuf-unstable-v1-client-protocol.h with a custom command
[366/2837] Compiling C++ object src/imgui/libimgui_core.a.p/imgui_draw.cpp.o
[367/2837] Compiling C++ object src/imgui/libimgui_core.a.p/imgui.cpp.o
[368/2837] Compiling C++ object src/compiler/glsl/tests/uniform_initializer_test.p/set_uniform_initializer_tests.cpp.o
[369/2837] Compiling C++ object src/compiler/glsl/tests/sampler_types_test.p/sampler_types_test.cpp.o
[370/2837] Compiling C++ object src/compiler/glsl/libglsl.a.p/lower_vec_index_to_cond_assign.cpp.o
[371/2837] Compiling C++ object src/compiler/glsl/libglsl.a.p/opt_dead_functions.cpp.o
[372/2837] Compiling C object src/compiler/glsl/libglsl.a.p/gl_nir_lower_samplers.c.o
[373/2837] Compiling C++ object src/compiler/glsl/libglsl.a.p/lower_vec_index_to_swizzle.cpp.o
[374/2837] Compiling C++ object src/compiler/glsl/libglsl.a.p/lower_vector.cpp.o
[375/2837] Compiling C++ object src/compiler/glsl/libglsl.a.p/lower_variable_index_to_cond_assign.cpp.o
[376/2837] Compiling C++ object src/compiler/glsl/libglsl.a.p/generate_ir.cpp.o
[377/2837] Compiling C object src/compiler/glsl/libglsl.a.p/gl_nir_lower_buffers.c.o
[378/2837] Compiling C++ object src/compiler/glsl/libglsl.a.p/meson-generated_.._glsl_parser.cpp.o
[379/2837] Compiling C++ object src/compiler/glsl/libglsl.a.p/builtin_types.cpp.o
[380/2837] Compiling C++ object src/compiler/glsl/libglsl.a.p/builtin_variables.cpp.o
[381/2837] Compiling C++ object src/compiler/glsl/libglsl.a.p/ast_expr.cpp.o
[382/2837] Compiling C++ object src/compiler/glsl/libglsl.a.p/meson-generated_.._glsl_lexer.cpp.o
[383/2837] Compiling C++ object src/compiler/glsl/libglsl.a.p/ast_array_index.cpp.o
[384/2837] Compiling C++ object src/compiler/glsl/libglsl.a.p/ast_function.cpp.o
[385/2837] Compiling C++ object src/compiler/glsl/libglsl.a.p/ast_type.cpp.o
[386/2837] Compiling C++ object src/compiler/glsl/libglsl.a.p/ast_to_hir.cpp.o
[387/2837] Compiling C object src/compiler/glsl/libglsl.a.p/gl_nir_link_xfb.c.o
[388/2837] Compiling C object src/compiler/glsl/libglsl.a.p/gl_nir_lower_atomics.c.o
[389/2837] Compiling C object src/compiler/glsl/libglsl.a.p/gl_nir_lower_images.c.o
[390/2837] Compiling C object src/compiler/glsl/libglsl.a.p/gl_nir_link_atomics.c.o
[391/2837] Compiling C++ object src/compiler/glsl/libglsl.a.p/builtin_functions.cpp.o
[392/2837] Compiling C object src/compiler/glsl/libglsl.a.p/gl_nir_link_uniform_initializers.c.o
[393/2837] Compiling C object src/compiler/glsl/libglsl.a.p/gl_nir_link_uniform_blocks.c.o
[394/2837] Compiling C object src/compiler/glsl/libglsl.a.p/gl_nir_link_uniforms.c.o
[395/2837] Compiling C object src/compiler/glsl/libglsl.a.p/gl_nir_lower_samplers_as_deref.c.o
[396/2837] Compiling C++ object src/compiler/glsl/libglsl.a.p/glsl_symbol_table.cpp.o
[397/2837] Compiling C++ object src/compiler/glsl/libglsl.a.p/glsl_parser_extras.cpp.o
[398/2837] Compiling C++ object src/compiler/glsl/libglsl.a.p/hir_field_selection.cpp.o
[399/2837] Compiling C object src/compiler/glsl/libglsl.a.p/gl_nir_linker.c.o
[400/2837] Compiling C++ object src/compiler/glsl/libglsl.a.p/ir_array_refcount.cpp.o
[401/2837] Compiling C++ object src/compiler/glsl/libglsl.a.p/ir_builder.cpp.o
[402/2837] Compiling C++ object src/compiler/glsl/libglsl.a.p/ir_clone.cpp.o
[403/2837] Compiling C++ object src/compiler/glsl/libglsl.a.p/ir_basic_block.cpp.o
[404/2837] Compiling C++ object src/compiler/glsl/libglsl.a.p/ir.cpp.o
[405/2837] Compiling C++ object src/compiler/glsl/libglsl.a.p/ir_equals.cpp.o
[406/2837] Compiling C++ object src/compiler/glsl/libglsl.a.p/ir_constant_expression.cpp.o
[407/2837] Compiling C++ object src/compiler/glsl/libglsl.a.p/ir_function_detect_recursion.cpp.o
[408/2837] Compiling C++ object src/compiler/glsl/libglsl.a.p/ir_function.cpp.o
[409/2837] Compiling C++ object src/compiler/glsl/libglsl.a.p/glsl_to_nir.cpp.o
[410/2837] Compiling C++ object src/compiler/glsl/libglsl.a.p/ir_hv_accept.cpp.o
[411/2837] Compiling C++ object src/compiler/glsl/libglsl.a.p/ir_expression_flattening.cpp.o
[412/2837] Compiling C++ object src/compiler/glsl/libglsl.a.p/ir_function_can_inline.cpp.o
[413/2837] Compiling C++ object src/compiler/glsl/libglsl.a.p/ir_print_visitor.cpp.o
[414/2837] Compiling C++ object src/compiler/glsl/libglsl.a.p/ir_rvalue_visitor.cpp.o
[415/2837] Compiling C++ object src/compiler/glsl/libglsl.a.p/ir_hierarchical_visitor.cpp.o
[416/2837] Compiling C++ object src/compiler/glsl/libglsl.a.p/ir_set_program_inouts.cpp.o
[417/2837] Compiling C++ object src/compiler/glsl/libglsl.a.p/ir_variable_refcount.cpp.o
[418/2837] Compiling C++ object src/compiler/glsl/libglsl.a.p/ir_validate.cpp.o
[419/2837] Compiling C++ object src/compiler/glsl/libglsl.a.p/ir_reader.cpp.o
[420/2837] Compiling C++ object src/compiler/glsl/libglsl.a.p/link_atomics.cpp.o
[421/2837] Compiling C++ object src/compiler/glsl/libglsl.a.p/linker_util.cpp.o
[422/2837] Compiling C++ object src/compiler/glsl/libglsl.a.p/linker.cpp.o
[423/2837] Compiling C++ object src/compiler/glsl/libglsl.a.p/link_functions.cpp.o
[424/2837] Compiling C++ object src/compiler/glsl/libglsl.a.p/link_uniforms.cpp.o
[425/2837] Compiling C++ object src/compiler/glsl/libglsl.a.p/link_uniform_initializers.cpp.o
[426/2837] Compiling C++ object src/compiler/glsl/libglsl.a.p/link_uniform_block_active_visitor.cpp.o
[427/2837] Compiling C++ object src/compiler/glsl/libglsl.a.p/link_interface_blocks.cpp.o
[428/2837] Compiling C++ object src/compiler/glsl/libglsl.a.p/lower_builtins.cpp.o
[429/2837] Compiling C++ object src/compiler/glsl/libglsl.a.p/loop_analysis.cpp.o
[430/2837] Compiling C++ object src/compiler/glsl/libglsl.a.p/lower_blend_equation_advanced.cpp.o
[431/2837] Compiling C++ object src/compiler/glsl/libglsl.a.p/lower_const_arrays_to_uniforms.cpp.o
[432/2837] Compiling C++ object src/compiler/glsl/libglsl.a.p/loop_unroll.cpp.o
[433/2837] Compiling C++ object src/compiler/glsl/libglsl.a.p/link_varyings.cpp.o
[434/2837] Compiling C++ object src/compiler/glsl/libglsl.a.p/link_uniform_blocks.cpp.o
[435/2837] Compiling C++ object src/compiler/glsl/libglsl.a.p/lower_buffer_access.cpp.o
[436/2837] Compiling C++ object src/compiler/glsl/libglsl.a.p/lower_discard.cpp.o
[437/2837] Compiling C++ object src/compiler/glsl/libglsl.a.p/lower_cs_derived.cpp.o
[438/2837] Compiling C++ object src/compiler/glsl/libglsl.a.p/lower_instructions.cpp.o
[439/2837] Compiling C++ object src/compiler/glsl/libglsl.a.p/lower_if_to_cond_assign.cpp.o
[440/2837] Compiling C++ object src/compiler/glsl/libglsl.a.p/lower_discard_flow.cpp.o
[441/2837] Compiling C++ object src/compiler/glsl/libglsl.a.p/lower_jumps.cpp.o
[442/2837] Compiling C++ object src/compiler/glsl/libglsl.a.p/lower_mat_op_to_vec.cpp.o
[443/2837] Compiling C++ object src/compiler/glsl/libglsl.a.p/lower_offset_array.cpp.o
[444/2837] Compiling C++ object src/compiler/glsl/libglsl.a.p/lower_distance.cpp.o
[445/2837] Compiling C++ object src/compiler/glsl/libglsl.a.p/opt_array_splitting.cpp.o
[446/2837] Compiling C++ object src/compiler/glsl/libglsl.a.p/lower_int64.cpp.o
[447/2837] Compiling C++ object src/compiler/glsl/libglsl.a.p/opt_conditional_discard.cpp.o
[448/2837] Compiling C++ object src/compiler/glsl/libglsl.a.p/lower_subroutine.cpp.o
[449/2837] Compiling C++ object src/compiler/glsl/libglsl.a.p/lower_named_interface_blocks.cpp.o
[450/2837] Compiling C++ object src/compiler/glsl/libglsl.a.p/lower_packed_varyings.cpp.o
[451/2837] Compiling C++ object src/compiler/glsl/libglsl.a.p/lower_packing_builtins.cpp.o
[452/2837] Compiling C++ object src/compiler/glsl/libglsl.a.p/lower_shared_reference.cpp.o
[453/2837] Compiling C++ object src/compiler/glsl/libglsl.a.p/lower_tess_level.cpp.o
[454/2837] Compiling C++ object src/compiler/glsl/libglsl.a.p/lower_precision.cpp.o
[455/2837] Generating shared_glapi_mapi_tmp.h with a custom command (wrapped by meson to capture output)
[456/2837] Compiling C++ object src/compiler/glsl/libglsl.a.p/lower_texture_projection.cpp.o
[457/2837] Compiling C++ object src/compiler/glsl/libglsl.a.p/opt_constant_variable.cpp.o
[458/2837] Compiling C++ object src/compiler/glsl/libglsl.a.p/lower_vector_insert.cpp.o
[459/2837] Compiling C++ object src/compiler/glsl/libglsl.a.p/opt_constant_propagation.cpp.o
[460/2837] Compiling C++ object src/compiler/glsl/libglsl.a.p/lower_vector_derefs.cpp.o
[461/2837] Compiling C++ object src/compiler/glsl/libglsl.a.p/lower_output_reads.cpp.o
[462/2837] Compiling C object src/mapi/shared-glapi/libglapi.so.0.0.0.p/.._u_execmem.c.o
[463/2837] Compiling C++ object src/compiler/glsl/libglsl.a.p/lower_vertex_id.cpp.o
[464/2837] Compiling C++ object src/compiler/glsl/libglsl.a.p/lower_xfb_varying.cpp.o
[465/2837] Compiling C++ object src/compiler/glsl/libglsl.a.p/lower_ubo_reference.cpp.o
[466/2837] Compiling C++ object src/compiler/glsl/libglsl.a.p/opt_dead_builtin_variables.cpp.o
[467/2837] Compiling C++ object src/compiler/glsl/libglsl.a.p/opt_constant_folding.cpp.o
[468/2837] Compiling C++ object src/compiler/glsl/libglsl.a.p/opt_algebraic.cpp.o
[469/2837] Compiling C++ object src/compiler/glsl/libglsl.a.p/opt_dead_builtin_varyings.cpp.o
[470/2837] Compiling C++ object src/compiler/glsl/libglsl.a.p/opt_copy_propagation_elements.cpp.o
[471/2837] Compiling C++ object src/compiler/glsl/libglsl.a.p/opt_dead_code.cpp.o
[472/2837] Compiling C++ object src/compiler/glsl/libglsl.a.p/opt_flatten_nested_if_blocks.cpp.o
[473/2837] Compiling C++ object src/compiler/glsl/libglsl.a.p/opt_if_simplification.cpp.o
[474/2837] Compiling C++ object src/compiler/glsl/libglsl.a.p/opt_rebalance_tree.cpp.o
[475/2837] Compiling C++ object src/compiler/glsl/libglsl.a.p/opt_flip_matrices.cpp.o
[476/2837] Compiling C++ object src/compiler/glsl/libglsl.a.p/opt_function_inlining.cpp.o
[477/2837] Compiling C++ object src/compiler/glsl/libglsl.a.p/opt_dead_code_local.cpp.o
[478/2837] Compiling C++ object src/compiler/glsl/libglsl.a.p/s_expression.cpp.o
[479/2837] Compiling C++ object src/compiler/glsl/libglsl.a.p/opt_redundant_jumps.cpp.o
[480/2837] Compiling C++ object src/compiler/glsl/libglsl.a.p/opt_structure_splitting.cpp.o
[481/2837] Compiling C++ object src/compiler/glsl/libglsl.a.p/serialize.cpp.o
[482/2837] Compiling C object src/mapi/shared-glapi/libglapi.so.0.0.0.p/.._mapi_glapi.c.o
[483/2837] Compiling C++ object src/compiler/glsl/libglsl.a.p/opt_minmax.cpp.o
[484/2837] Compiling C++ object src/compiler/glsl/libglsl.a.p/string_to_uint_map.cpp.o
[485/2837] Linking static target src/drm-shim/libdrm_shim.a
[486/2837] Compiling C object src/egl/wayland/wayland-drm/libwayland_drm.a.p/meson-generated_.._wayland-drm-protocol.c.o
[487/2837] Compiling C++ object src/compiler/glsl/libglsl.a.p/propagate_invariance.cpp.o
[488/2837] Compiling C++ object src/compiler/glsl/libglsl.a.p/opt_vectorize.cpp.o
[489/2837] Compiling C++ object src/compiler/glsl/libglsl.a.p/opt_tree_grafting.cpp.o
[490/2837] Compiling C++ object src/compiler/glsl/libglsl.a.p/opt_swizzle.cpp.o
[491/2837] Compiling C object src/mapi/shared-glapi/libglapi.so.0.0.0.p/.._u_current.c.o
[492/2837] Compiling C++ object src/amd/addrlib/libaddrlib.a.p/src_core_addrlib.cpp.o
[493/2837] Compiling C++ object src/compiler/glsl/libglsl.a.p/shader_cache.cpp.o
[494/2837] Compiling C++ object src/amd/addrlib/libaddrlib.a.p/src_core_addrelemlib.cpp.o
[495/2837] Compiling C++ object src/amd/addrlib/libaddrlib.a.p/src_addrinterface.cpp.o
[496/2837] Compiling C object src/mapi/shared-glapi/libglapi.so.0.0.0.p/.._entry.c.o
[497/2837] Compiling C++ object src/amd/addrlib/libaddrlib.a.p/src_core_addrlib1.cpp.o
[498/2837] Compiling C++ object src/amd/addrlib/libaddrlib.a.p/src_core_coord.cpp.o
[499/2837] Compiling C++ object src/amd/addrlib/libaddrlib.a.p/src_core_addrlib2.cpp.o
[500/2837] Generating indirect_size.h with a custom command (wrapped by meson to capture output)
[501/2837] Linking static target src/imgui/libimgui_core.a
[502/2837] Compiling C++ object src/amd/addrlib/libaddrlib.a.p/src_core_addrobject.cpp.o
[503/2837] Compiling C++ object src/amd/addrlib/libaddrlib.a.p/src_gfx9_gfx9addrlib.cpp.o
[504/2837] Compiling C++ object src/amd/addrlib/libaddrlib.a.p/src_r800_ciaddrlib.cpp.o
[505/2837] Compiling C++ object src/amd/addrlib/libaddrlib.a.p/src_gfx10_gfx10addrlib.cpp.o
[506/2837] Compiling C++ object src/amd/addrlib/libaddrlib.a.p/src_r800_egbaddrlib.cpp.o
[507/2837] Compiling C++ object src/amd/addrlib/libaddrlib.a.p/src_r800_siaddrlib.cpp.o
[508/2837] Linking static target src/amd/addrlib/libaddrlib.a
[509/2837] Compiling C object src/egl/wayland/wayland-drm/libwayland_drm.a.p/wayland-drm.c.o
[510/2837] Linking static target src/egl/wayland/wayland-drm/libwayland_drm.a
[511/2837] Compiling C object src/mapi/shared-glapi/libglapi.so.0.0.0.p/.._stub.c.o
[512/2837] Compiling C object src/mapi/shared-glapi/libglapi.so.0.0.0.p/.._table.c.o
[513/2837] Linking static target src/compiler/glsl/libglsl.a
[514/2837] Linking target src/mapi/shared-glapi/libglapi.so.0.0.0
[515/2837] Generating vk_common_entrypoints with a custom command
[516/2837] Generating radeon_icd with a custom command
[517/2837] Generating vk_extensions with a custom command
[518/2837] Generating vk_enum_to_str with a custom command
[519/2837] Generating vk_dispatch_table with a custom command
[520/2837] Compiling C object src/vulkan/util/libvulkan_util.a.p/meson-generated_.._vk_enum_to_str.c.o
[521/2837] Compiling C object src/vulkan/util/libvulkan_util.a.p/meson-generated_.._vk_extensions.c.o
[522/2837] Generating radv_entrypoints with a custom command
[523/2837] Compiling C object src/vulkan/util/libvulkan_util.a.p/vk_cmd_copy.c.o
[524/2837] Compiling C object src/vulkan/util/libvulkan_util.a.p/meson-generated_.._vk_common_entrypoints.c.o
[525/2837] Compiling C object src/vulkan/util/libvulkan_util.a.p/meson-generated_.._vk_dispatch_table.c.o
[526/2837] Compiling C object src/vulkan/util/libvulkan_util.a.p/vk_render_pass.c.o
[527/2837] Compiling C object src/vulkan/wsi/libvulkan_wsi.a.p/wsi_common_wayland.c.o
[528/2837] Compiling C object src/vulkan/wsi/libvulkan_wsi.a.p/wsi_common_display.c.o
[529/2837] Compiling C object src/vulkan/wsi/libvulkan_wsi.a.p/wsi_common.c.o
[530/2837] Compiling C object src/vulkan/wsi/libvulkan_wsi.a.p/meson-generated_.._.._.._egl_wayland_wayland-drm_linux-dmabuf-unstable-v1-protocol.c.o
[531/2837] Compiling C object src/vulkan/util/libvulkan_util.a.p/vk_shader_module.c.o
[532/2837] Compiling C object src/vulkan/util/libvulkan_util.a.p/vk_debug_report.c.o
[533/2837] Compiling C object src/vulkan/util/libvulkan_util.a.p/vk_descriptors.c.o
[534/2837] Compiling C object src/vulkan/util/libvulkan_util.a.p/vk_deferred_operation.c.o
[535/2837] Generating symbol file src/mapi/shared-glapi/libglapi.so.0.0.0.p/libglapi.so.0.0.0.symbols
[536/2837] Compiling C object src/vulkan/util/libvulkan_util.a.p/vk_format.c.o
[537/2837] Compiling C object src/vulkan/util/libvulkan_util.a.p/vk_device.c.o
[538/2837] Linking target src/mapi/es1api/libGLESv1_CM.so.1.1.0
[539/2837] Linking target src/mapi/es2api/libGLESv2.so.2.0.0
[540/2837] Generating gfx10_format_table.c with a custom command (wrapped by meson to capture output)
[541/2837] Compiling C object src/vulkan/util/libvulkan_util.a.p/vk_instance.c.o
[542/2837] Compiling C object src/vulkan/util/libvulkan_util.a.p/vk_object.c.o
[543/2837] Compiling C object src/vulkan/util/libvulkan_util.a.p/vk_physical_device.c.o
[544/2837] Compiling C object src/vulkan/wsi/libvulkan_wsi.a.p/meson-generated_.._.._.._egl_wayland_wayland-drm_wayland-drm-protocol.c.o
[545/2837] Compiling C object src/vulkan/util/libvulkan_util.a.p/vk_util.c.o
[546/2837] Compiling C object src/vulkan/wsi/libvulkan_wsi.a.p/wsi_common_drm.c.o
[547/2837] Compiling C object src/vulkan/wsi/libvulkan_wsi.a.p/wsi_common_x11.c.o
[548/2837] Linking static target src/vulkan/util/libvulkan_util.a
[549/2837] Generating aco_opcodes.cpp with a custom command (wrapped by meson to capture output)
[550/2837] Generating gen8_pack.h with a custom command (wrapped by meson to capture output)
[551/2837] Generating aco_opcodes.h with a custom command (wrapped by meson to capture output)
[552/2837] Generating gen75_pack.h with a custom command (wrapped by meson to capture output)
[553/2837] Generating aco_builder.h with a custom command (wrapped by meson to capture output)
[554/2837] Generating gen4_pack.h with a custom command (wrapped by meson to capture output)
[555/2837] Generating gen5_pack.h with a custom command (wrapped by meson to capture output)
[556/2837] Generating gen45_pack.h with a custom command (wrapped by meson to capture output)
[557/2837] Compiling C object src/intel/dev/intel_device_info_test.p/intel_device_info_test.c.o
[558/2837] Linking target src/mapi/shared-glapi/shared-glapi-test
[559/2837] Compiling C object src/intel/dev/libintel_dev.a.p/intel_debug.c.o
[560/2837] Generating genX_bits.h with a custom command
[561/2837] Compiling C object src/intel/dev/intel_dev_info.p/intel_dev_info.c.o
[562/2837] Generating isl_format_layout.c with a custom command
[563/2837] Generating gen6_pack.h with a custom command (wrapped by meson to capture output)
[564/2837] Generating gen9_pack.h with a custom command (wrapped by meson to capture output)
[565/2837] Generating gen_rt_pack.h with a custom command (wrapped by meson to capture output)
[566/2837] Compiling C object src/intel/isl/libisl.a.p/isl_aux_info.c.o
[567/2837] Generating gen7_pack.h with a custom command (wrapped by meson to capture output)
[568/2837] Compiling C object src/intel/isl/libisl.a.p/meson-generated_.._isl_format_layout.c.o
[569/2837] Generating gen11_pack.h with a custom command (wrapped by meson to capture output)
[570/2837] Compiling C object src/intel/isl/libisl.a.p/isl_drm.c.o
[571/2837] Generating gen12_pack.h with a custom command (wrapped by meson to capture output)
[572/2837] Generating genX_xml.h with a custom command (wrapped by meson to capture output)
[573/2837] Compiling C object src/intel/isl/isl_aux_info_test.p/isl_aux_info.c.o
[574/2837] Generating gen125_pack.h with a custom command (wrapped by meson to capture output)
[575/2837] Compiling C object src/intel/isl/isl_surf_get_image_offset_test.p/tests_isl_surf_get_image_offset_test.c.o
[576/2837] Compiling C object src/intel/isl/libisl.a.p/isl_storage_image.c.o
[577/2837] Generating gentest_pack.h with a custom command (wrapped by meson to capture output)
[578/2837] Generating brw_nir_trig_workarounds.c with a custom command (wrapped by meson to capture output)
[579/2837] Compiling C object src/intel/dev/libintel_dev.a.p/intel_device_info.c.o
[580/2837] Linking static target src/intel/dev/libintel_dev.a
[581/2837] Compiling C object src/mesa/drivers/dri/i965/libi965.a.p/brw_tes.c.o
[582/2837] Generating format_srgb with a custom command (wrapped by meson to capture output)
[583/2837] Compiling C object src/util/libmesa_util.a.p/meson-generated_.._format_srgb.c.o
[584/2837] Linking static target src/util/libmesa_util.a
[585/2837] Compiling C object src/intel/isl/libisl_per_hw_ver40.a.p/isl_surface_state.c.o
[586/2837] Compiling C object src/intel/blorp/libblorp.a.p/blorp.c.o
[587/2837] Compiling C object src/mesa/drivers/dri/i965/libi965.a.p/brw_sf.c.o
[588/2837] Compiling C object src/intel/isl/libisl_per_hw_ver50.a.p/isl_emit_depth_stencil.c.o
[589/2837] Linking target src/util/u_atomic_test
[590/2837] Linking target src/util/blob_test
[591/2837] Linking target src/util/rb_tree_test
[592/2837] Linking target src/util/mesa-sha1_test
[593/2837] Linking target src/util/tests/vector/vector_test
[594/2837] Linking target src/util/tests/cache/cache_test
[595/2837] Linking target src/util/process_test
[596/2837] Compiling C++ object src/intel/compiler/libintel_compiler.a.p/brw_cfg.cpp.o
[597/2837] Linking target src/util/xmlconfig_test
[598/2837] Linking target src/util/tests/hash_table/clear_test
[599/2837] Linking target src/util/bitset_test
[600/2837] Linking target src/util/tests/hash_table/collision_test
[601/2837] Compiling C object src/intel/isl/libisl_tiled_memcpy.a.p/isl_tiled_memcpy_normal.c.o
[602/2837] Linking target src/util/tests/hash_table/delete_and_lookup_test
[603/2837] Linking target src/util/u_debug_stack_test
[604/2837] Linking target src/util/tests/hash_table/insert_and_lookup_test
[605/2837] Linking target src/util/tests/hash_table/delete_management_test
[606/2837] Linking target src/util/tests/hash_table/destroy_callback_test
[607/2837] Linking target src/util/tests/fast_idiv_by_const/fast_idiv_by_const_test
[608/2837] Linking target src/util/tests/hash_table/null_destroy_test
[609/2837] Compiling C object src/intel/isl/libisl.a.p/isl_format.c.o
[610/2837] Linking target src/util/tests/hash_table/remove_key_test
[611/2837] Linking target src/util/tests/hash_table/insert_many_test
[612/2837] Linking target src/util/tests/hash_table/random_entry_test
[613/2837] Linking target src/util/tests/hash_table/remove_null_test
[614/2837] Linking target src/util/tests/hash_table/replacement_test
[615/2837] Linking target src/util/tests/set/set_test
[616/2837] Linking target src/util/tests/sparse_array/multi_threaded
[617/2837] Linking target src/util/tests/fast_urem_by_const/fast_urem_by_const_test
[618/2837] Linking target src/util/tests/format/srgb
[619/2837] Linking target src/compiler/glsl/glcpp/glcpp
[620/2837] Linking target src/util/tests/vma/vma_random_test
[621/2837] Linking target src/util/tests/format/u_format_test
[622/2837] Linking static target src/vulkan/wsi/libvulkan_wsi.a
[623/2837] Linking target src/util/tests/format/u_format_compatible_test
[624/2837] Compiling C object src/intel/compiler/libintel_compiler.a.p/brw_clip_line.c.o
[625/2837] Linking target src/intel/dev/intel_device_info_test
[626/2837] Compiling C object src/intel/isl/libisl_tiled_memcpy_sse41.a.p/isl_tiled_memcpy_sse41.c.o
[627/2837] Linking target src/intel/dev/intel_dev_info
[628/2837] Linking target src/util/tests/timespec/timespec_test
[629/2837] Linking target src/util/tests/string_buffer/string_buffer_test
[630/2837] Compiling C object src/intel/isl/libisl_per_hw_ver40.a.p/isl_gfx4.c.o
[631/2837] Compiling C object src/intel/isl/libisl_per_hw_ver60.a.p/isl_gfx6.c.o
[632/2837] Compiling C object src/intel/isl/libisl_per_hw_ver70.a.p/isl_gfx7.c.o
[633/2837] Compiling C object src/intel/isl/libisl_per_hw_ver80.a.p/isl_gfx8.c.o
[634/2837] Compiling C object src/intel/isl/libisl_per_hw_ver40.a.p/isl_emit_depth_stencil.c.o
[635/2837] Linking static target src/intel/isl/libisl_per_hw_ver40.a
[636/2837] Compiling C object src/intel/isl/libisl_per_hw_ver60.a.p/isl_surface_state.c.o
[637/2837] Compiling C object src/intel/isl/libisl_per_hw_ver60.a.p/isl_emit_depth_stencil.c.o
[638/2837] Linking static target src/intel/isl/libisl_per_hw_ver60.a
[639/2837] Linking static target src/intel/isl/libisl_tiled_memcpy.a
[640/2837] Linking static target src/intel/isl/libisl_tiled_memcpy_sse41.a
[641/2837] Compiling C object src/intel/isl/libisl.a.p/isl.c.o
[642/2837] Compiling C object src/intel/isl/libisl_per_hw_ver90.a.p/isl_gfx9.c.o
[643/2837] Compiling C object src/intel/isl/libisl_per_hw_ver50.a.p/isl_surface_state.c.o
[644/2837] Linking static target src/intel/isl/libisl_per_hw_ver50.a
[645/2837] Compiling C object src/intel/isl/libisl_per_hw_ver70.a.p/isl_surface_state.c.o
[646/2837] Compiling C object src/intel/isl/libisl_per_hw_ver75.a.p/isl_emit_depth_stencil.c.o
[647/2837] Compiling C object src/intel/isl/libisl_per_hw_ver120.a.p/isl_gfx12.c.o
[648/2837] Compiling C object src/intel/isl/libisl_per_hw_ver75.a.p/isl_surface_state.c.o
[649/2837] Linking static target src/intel/isl/libisl_per_hw_ver75.a
[650/2837] Compiling C object src/intel/isl/libisl_per_hw_ver80.a.p/isl_emit_depth_stencil.c.o
[651/2837] Compiling C object src/intel/isl/libisl_per_hw_ver70.a.p/isl_emit_depth_stencil.c.o
[652/2837] Compiling C object src/intel/isl/libisl_per_hw_ver125.a.p/isl_gfx12.c.o
[653/2837] Linking static target src/intel/isl/libisl_per_hw_ver70.a
[654/2837] Linking static target src/intel/isl/libisl.a
[655/2837] Compiling C object src/intel/common/libintel_common.a.p/intel_gem.c.o
[656/2837] Compiling C object src/intel/isl/libisl_per_hw_ver90.a.p/isl_emit_depth_stencil.c.o
[657/2837] Compiling C object src/intel/isl/libisl_per_hw_ver110.a.p/isl_emit_depth_stencil.c.o
[658/2837] Compiling C object src/intel/isl/libisl_per_hw_ver120.a.p/isl_emit_depth_stencil.c.o
[659/2837] Compiling C object src/intel/isl/libisl_per_hw_ver80.a.p/isl_surface_state.c.o
[660/2837] Linking static target src/intel/isl/libisl_per_hw_ver80.a
[661/2837] Compiling C object src/intel/isl/libisl_per_hw_ver90.a.p/isl_surface_state.c.o
[662/2837] Linking static target src/intel/isl/libisl_per_hw_ver90.a
[663/2837] Compiling C object src/intel/isl/libisl_per_hw_ver125.a.p/isl_emit_depth_stencil.c.o
[664/2837] Compiling C object src/intel/isl/libisl_per_hw_ver110.a.p/isl_surface_state.c.o
[665/2837] Linking static target src/intel/isl/libisl_per_hw_ver110.a
[666/2837] Compiling C object src/intel/common/libintel_common.a.p/intel_sample_positions.c.o
[667/2837] Compiling C object src/intel/isl/libisl_per_hw_ver125.a.p/isl_surface_state.c.o
[668/2837] Linking static target src/intel/isl/libisl_per_hw_ver125.a
[669/2837] Compiling C object src/intel/common/libintel_common.a.p/intel_measure.c.o
[670/2837] Compiling C object src/intel/common/libintel_common.a.p/intel_aux_map.c.o
[671/2837] Compiling C object src/intel/common/libintel_common.a.p/intel_urb_config.c.o
[672/2837] Compiling C object src/intel/common/libintel_common.a.p/intel_uuid.c.o
[673/2837] Compiling C object src/intel/common/libintel_common.a.p/intel_l3_config.c.o
[674/2837] Compiling C object src/intel/isl/libisl_per_hw_ver120.a.p/isl_surface_state.c.o
[675/2837] Linking static target src/intel/isl/libisl_per_hw_ver120.a
[676/2837] Compiling C object src/intel/common/libintel_common.a.p/intel_disasm.c.o
[677/2837] Compiling C object src/intel/common/genxml_test.p/tests_genxml_test.c.o
[678/2837] Linking target src/intel/isl/isl_surf_get_image_offset_test
[679/2837] Compiling C object src/mesa/drivers/dri/i965/libi965_per_hw_ver70.a.p/genX_pipe_control.c.o
[680/2837] Compiling C object src/intel/common/libintel_common.a.p/intel_batch_decoder.c.o
[681/2837] Compiling C object src/intel/compiler/libintel_compiler.a.p/brw_clip_point.c.o
[682/2837] Compiling C object src/intel/compiler/libintel_compiler.a.p/brw_compile_clip.c.o
[683/2837] Compiling C object src/intel/compiler/libintel_compiler.a.p/meson-generated_.._brw_nir_trig_workarounds.c.o
[684/2837] Compiling C object src/intel/compiler/libintel_compiler.a.p/brw_compiler.c.o
[685/2837] Compiling C++ object src/intel/compiler/fs_copy_propagation.p/test_fs_copy_propagation.cpp.o
[686/2837] Compiling C++ object src/intel/compiler/libintel_compiler.a.p/brw_dead_control_flow.cpp.o
[687/2837] Compiling C object src/intel/common/libintel_common.a.p/intel_decoder.c.o
[688/2837] Linking static target src/intel/common/libintel_common.a
[689/2837] Compiling C++ object src/intel/compiler/libintel_compiler.a.p/brw_fs_live_variables.cpp.o
[690/2837] Linking target src/intel/common/genxml_test
[691/2837] Compiling C++ object src/intel/compiler/libintel_compiler.a.p/brw_fs_lower_pack.cpp.o
[692/2837] Compiling C object src/intel/compiler/libintel_compiler.a.p/brw_debug_recompile.c.o
[693/2837] Compiling C object src/mesa/drivers/dri/i965/libi965_per_hw_ver70.a.p/genX_blorp_exec.c.o
[694/2837] Generating nir_opt_algebraic.c with a custom command (wrapped by meson to capture output)
[695/2837] Compiling C object src/intel/blorp/libblorp.a.p/blorp_clear.c.o
[696/2837] Compiling C object src/compiler/nir/libnir.a.p/meson-generated_.._nir_opt_algebraic.c.o
[697/2837] Compiling C object src/intel/compiler/libintel_compiler.a.p/brw_disasm_info.c.o
[698/2837] Compiling C object src/intel/compiler/libintel_compiler.a.p/brw_clip_unfilled.c.o
[699/2837] Linking static target src/compiler/nir/libnir.a
[700/2837] Compiling C object src/intel/compiler/libintel_compiler.a.p/brw_clip_util.c.o
[701/2837] Compiling C object src/intel/blorp/libblorp.a.p/blorp_blit.c.o
[702/2837] Compiling C object src/intel/compiler/libintel_compiler.a.p/brw_compile_sf.c.o
[703/2837] Compiling C object src/intel/compiler/libintel_compiler.a.p/brw_eu_util.c.o
[704/2837] Linking target src/compiler/nir/nir_builder_test
[705/2837] Compiling C++ object src/intel/compiler/libintel_compiler.a.p/brw_eu.cpp.o
[706/2837] Linking target src/compiler/nir/nir_control_flow_test
[707/2837] Compiling C++ object src/intel/compiler/libintel_compiler.a.p/brw_fs_bank_conflicts.cpp.o
[708/2837] Linking target src/compiler/nir/nir_vars_test
[709/2837] Compiling C++ object src/intel/compiler/libintel_compiler.a.p/brw_fs_cmod_propagation.cpp.o
[710/2837] Linking target src/compiler/nir/comparison_pre
[711/2837] Compiling C object src/intel/compiler/libintel_compiler.a.p/brw_clip_tri.c.o
[712/2837] Linking target src/compiler/nir/nir_serialize_test
[713/2837] Linking target src/compiler/nir/negative_equal
[714/2837] Linking target src/compiler/nir/load_store_vectorizer
[715/2837] Compiling C object src/intel/compiler/libintel_compiler.a.p/brw_eu_compact.c.o
[716/2837] Linking target src/compiler/nir/nir_lower_returns_tests
[717/2837] Compiling C++ object src/intel/compiler/libintel_compiler.a.p/brw_fs_combine_constants.cpp.o
[718/2837] Compiling C object src/intel/compiler/libintel_compiler.a.p/brw_disasm.c.o
[719/2837] Linking static target src/intel/blorp/libblorp.a
[720/2837] Linking target src/compiler/nir/nir_opt_if_tests
[721/2837] Linking target src/compiler/nir/ssa_def_bits_used
[722/2837] Linking target src/compiler/glsl/tests/list_iterators
[723/2837] Linking target src/compiler/glsl/tests/uniform_initializer_test
[724/2837] Linking target src/compiler/avail_vis
[725/2837] Linking target src/compiler/glsl/glsl_compiler
[726/2837] Linking target src/compiler/glsl/tests/sampler_types_test
[727/2837] Linking target src/compiler/glsl/glsl_test
[728/2837] Linking target src/compiler/spirv2nir
[729/2837] Linking target src/compiler/volatile
[730/2837] Linking target src/compiler/glsl/tests/general_ir_test
[731/2837] Generating amdgfxregs_h with a custom command (wrapped by meson to capture output)
[732/2837] Compiling C object src/amd/common/ac_surface_modifier_test.p/ac_surface_modifier_test.c.o
[733/2837] Compiling C object src/intel/compiler/libintel_compiler.a.p/brw_eu_validate.c.o
[734/2837] Compiling C object src/amd/common/ac_surface_meta_address_test.p/ac_surface_meta_address_test.c.o
[735/2837] Compiling C object src/amd/llvm/libamd_common_llvm.a.p/ac_llvm_build.c.o
[736/2837] Compiling C object src/amd/llvm/libamd_common_llvm.a.p/ac_llvm_cull.c.o
[737/2837] Compiling C++ object src/intel/compiler/libintel_compiler.a.p/brw_fs_copy_propagation.cpp.o
[738/2837] Compiling C++ object src/intel/compiler/libintel_compiler.a.p/brw_fs_dead_code_eliminate.cpp.o
[739/2837] Compiling C++ object src/amd/compiler/libaco.a.p/aco_form_hard_clauses.cpp.o
[740/2837] Compiling C++ object src/amd/compiler/libaco.a.p/aco_insert_exec_mask.cpp.o
[741/2837] Compiling C object src/amd/llvm/libamd_common_llvm.a.p/ac_llvm_util.c.o
[742/2837] Compiling C++ object src/amd/compiler/libaco.a.p/aco_ir.cpp.o
[743/2837] Compiling C++ object src/amd/compiler/libaco.a.p/meson-generated_.._aco_opcodes.cpp.o
[744/2837] Compiling C++ object src/intel/isl/isl_aux_info_test.p/tests_isl_aux_info_test.cpp.o
[745/2837] Compiling C object src/amd/llvm/libamd_common_llvm.a.p/ac_nir_to_llvm.c.o
[746/2837] Compiling C++ object src/amd/compiler/libaco.a.p/aco_dead_code_analysis.cpp.o
[747/2837] Compiling C++ object src/amd/compiler/libaco.a.p/aco_dominance.cpp.o
[748/2837] Compiling C++ object src/amd/llvm/libamd_common_llvm.a.p/ac_llvm_helper.cpp.o
[749/2837] Linking static target src/amd/llvm/libamd_common_llvm.a
[750/2837] Compiling C++ object src/intel/compiler/libintel_compiler.a.p/brw_fs_cse.cpp.o
[751/2837] Compiling C object src/intel/compiler/libintel_compiler.a.p/brw_eu_emit.c.o
[752/2837] Compiling C++ object src/intel/compiler/libintel_compiler.a.p/brw_fs_saturate_propagation.cpp.o
[753/2837] Compiling C++ object src/intel/compiler/libintel_compiler.a.p/brw_fs_register_coalesce.cpp.o
[754/2837] Compiling C++ object src/amd/compiler/libaco.a.p/aco_instruction_selection.cpp.o
[755/2837] Compiling C++ object src/amd/compiler/libaco.a.p/aco_instruction_selection_setup.cpp.o
[756/2837] Compiling C++ object src/amd/compiler/libaco.a.p/aco_interface.cpp.o
[757/2837] Compiling C++ object src/amd/compiler/libaco.a.p/aco_assembler.cpp.o
[758/2837] Compiling C object src/intel/compiler/libintel_compiler.a.p/brw_nir_opt_peephole_ffma.c.o
[759/2837] Compiling C++ object src/intel/compiler/libintel_compiler.a.p/brw_fs_lower_regioning.cpp.o
[760/2837] Compiling C++ object src/amd/compiler/libaco.a.p/aco_lower_phis.cpp.o
[761/2837] Compiling C++ object src/intel/compiler/libintel_compiler.a.p/brw_fs_reg_allocate.cpp.o
[762/2837] Compiling C++ object src/amd/compiler/libaco.a.p/aco_lower_to_cssa.cpp.o
[763/2837] Compiling C++ object src/intel/compiler/libintel_compiler.a.p/brw_fs_scoreboard.cpp.o
[764/2837] Compiling C++ object src/amd/compiler/libaco.a.p/aco_register_allocation.cpp.o
[765/2837] Compiling C++ object src/amd/compiler/libaco.a.p/aco_insert_NOPs.cpp.o
[766/2837] Compiling C++ object src/amd/compiler/libaco.a.p/aco_reduce_assign.cpp.o
[767/2837] Compiling C++ object src/amd/compiler/libaco.a.p/aco_insert_waitcnt.cpp.o
[768/2837] Compiling C++ object src/amd/compiler/libaco.a.p/aco_live_var_analysis.cpp.o
[769/2837] Compiling C object src/amd/vulkan/libvulkan_radeon.so.p/meson-generated_.._radv_entrypoints.c.o
[770/2837] Compiling C++ object src/amd/compiler/libaco.a.p/aco_scheduler.cpp.o
[771/2837] Compiling C object src/amd/vulkan/libvulkan_radeon.so.p/winsys_null_radv_null_cs.c.o
[772/2837] Compiling C++ object src/amd/compiler/libaco.a.p/aco_print_asm.cpp.o
[773/2837] Compiling C++ object src/amd/compiler/libaco.a.p/aco_opt_value_numbering.cpp.o
[774/2837] Compiling C++ object src/amd/compiler/libaco.a.p/aco_reindex_ssa.cpp.o
[775/2837] Compiling C++ object src/amd/compiler/libaco.a.p/aco_optimizer.cpp.o
[776/2837] Compiling C++ object src/amd/compiler/libaco.a.p/aco_print_ir.cpp.o
[777/2837] Compiling C object src/amd/vulkan/libvulkan_radeon.so.p/winsys_null_radv_null_winsys.c.o
[778/2837] Compiling C++ object src/amd/compiler/libaco.a.p/aco_validate.cpp.o
[779/2837] Compiling C++ object src/amd/compiler/libaco.a.p/aco_ssa_elimination.cpp.o
[780/2837] Compiling C object src/amd/vulkan/libvulkan_radeon.so.p/winsys_null_radv_null_bo.c.o
[781/2837] Compiling C++ object src/amd/compiler/libaco.a.p/aco_statistics.cpp.o
[782/2837] Compiling C++ object src/amd/compiler/libaco.a.p/aco_spill.cpp.o
[783/2837] Compiling C++ object src/amd/compiler/libaco.a.p/aco_lower_to_hw_instr.cpp.o
[784/2837] Compiling C object src/amd/vulkan/libvulkan_radeon.so.p/layers_radv_sqtt_layer.c.o
[785/2837] Compiling C++ object src/amd/vulkan/libvulkan_radeon.so.p/radv_llvm_helper.cpp.o
[786/2837] Compiling C object src/amd/vulkan/libvulkan_radeon.so.p/radv_android.c.o
[787/2837] Compiling C object src/amd/vulkan/libvulkan_radeon.so.p/radv_descriptor_set.c.o
[788/2837] Compiling C object src/amd/vulkan/libvulkan_radeon.so.p/radv_debug.c.o
[789/2837] Compiling C object src/amd/vulkan/libvulkan_radeon.so.p/radv_image.c.o
[790/2837] Linking static target src/amd/compiler/libaco.a
[791/2837] Compiling C object src/amd/vulkan/libvulkan_radeon.so.p/radv_cmd_buffer.c.o
[792/2837] Compiling C object src/amd/vulkan/libvulkan_radeon.so.p/radv_formats.c.o
[793/2837] Compiling C object src/amd/vulkan/libvulkan_radeon.so.p/radv_meta.c.o
[794/2837] Compiling C object src/amd/vulkan/libvulkan_radeon.so.p/radv_meta_dcc_retile.c.o
[795/2837] Compiling C object src/amd/vulkan/libvulkan_radeon.so.p/radv_meta_blit2d.c.o
[796/2837] Compiling C object src/amd/vulkan/libvulkan_radeon.so.p/radv_meta_buffer.c.o
[797/2837] Compiling C object src/amd/vulkan/libvulkan_radeon.so.p/radv_meta_blit.c.o
[798/2837] Compiling C object src/amd/vulkan/libvulkan_radeon.so.p/radv_meta_copy_vrs_htile.c.o
[799/2837] Compiling C object src/amd/vulkan/libvulkan_radeon.so.p/radv_meta_bufimage.c.o
[800/2837] Compiling C object src/amd/vulkan/libvulkan_radeon.so.p/radv_meta_decompress.c.o
[801/2837] Compiling C object src/amd/vulkan/libvulkan_radeon.so.p/radv_meta_copy.c.o
[802/2837] Compiling C object src/amd/vulkan/libvulkan_radeon.so.p/radv_meta_resolve.c.o
[803/2837] Compiling C object src/amd/vulkan/libvulkan_radeon.so.p/radv_pass.c.o
[804/2837] Compiling C object src/amd/vulkan/libvulkan_radeon.so.p/radv_meta_clear.c.o
[805/2837] Compiling C object src/amd/vulkan/libvulkan_radeon.so.p/radv_nir_to_llvm.c.o
[806/2837] Compiling C object src/amd/vulkan/libvulkan_radeon.so.p/radv_meta_resolve_fs.c.o
[807/2837] Compiling C object src/amd/vulkan/libvulkan_radeon.so.p/radv_meta_fmask_expand.c.o
[808/2837] Compiling C object src/amd/vulkan/libvulkan_radeon.so.p/radv_meta_fast_clear.c.o
[809/2837] Compiling C object src/amd/vulkan/libvulkan_radeon.so.p/radv_pipeline_cache.c.o
[810/2837] Compiling C object src/amd/vulkan/libvulkan_radeon.so.p/radv_sqtt.c.o
[811/2837] Compiling C object src/amd/vulkan/libvulkan_radeon.so.p/radv_meta_resolve_cs.c.o
[812/2837] Compiling C object src/amd/vulkan/libvulkan_radeon.so.p/radv_shader_args.c.o
[813/2837] Compiling C object src/amd/vulkan/libvulkan_radeon.so.p/radv_nir_lower_ycbcr_textures.c.o
[814/2837] Compiling C object src/amd/vulkan/libvulkan_radeon.so.p/radv_pipeline.c.o
[815/2837] Compiling C object src/amd/vulkan/libvulkan_radeon.so.p/radv_util.c.o
[816/2837] Compiling C object src/amd/vulkan/libvulkan_radeon.so.p/winsys_amdgpu_radv_amdgpu_surface.c.o
[817/2837] Compiling C object src/amd/vulkan/libvulkan_radeon.so.p/si_cmd_buffer.c.o
[818/2837] Compiling C object src/amd/vulkan/libvulkan_radeon.so.p/winsys_amdgpu_radv_amdgpu_bo.c.o
[819/2837] Compiling C object src/amd/vulkan/libvulkan_radeon.so.p/radv_shader_info.c.o
[820/2837] Compiling C object src/amd/vulkan/libvulkan_radeon.so.p/radv_query.c.o
[821/2837] Compiling C object src/amd/vulkan/libvulkan_radeon.so.p/radv_wsi_wayland.c.o
[822/2837] Compiling C object src/amd/vulkan/libvulkan_radeon.so.p/radv_wsi.c.o
[823/2837] Compiling C object src/amd/vulkan/libvulkan_radeon.so.p/winsys_amdgpu_radv_amdgpu_cs.c.o
[824/2837] Compiling C object src/amd/vulkan/libvulkan_radeon.so.p/radv_shader.c.o
[825/2837] Compiling C object src/amd/vulkan/libvulkan_radeon.so.p/radv_wsi_display.c.o
[826/2837] Compiling C object src/intel/compiler/libintel_compiler.a.p/brw_nir_lower_shader_calls.c.o
[827/2837] Compiling C object src/amd/vulkan/libvulkan_radeon.so.p/winsys_amdgpu_radv_amdgpu_winsys.c.o
[828/2837] Compiling C object src/amd/vulkan/libvulkan_radeon.so.p/radv_wsi_x11.c.o
[829/2837] Linking target src/intel/isl/isl_aux_info_test
[830/2837] Compiling C object src/intel/compiler/libintel_compiler.a.p/brw_interpolation_map.c.o
[831/2837] Compiling C++ object src/intel/compiler/libintel_compiler.a.p/brw_fs_validate.cpp.o
[832/2837] Compiling C++ object src/intel/compiler/libintel_compiler.a.p/brw_fs_generator.cpp.o
[833/2837] Compiling C object src/intel/compiler/libintel_compiler.a.p/brw_nir_analyze_boolean_resolves.c.o
[834/2837] Compiling C object src/intel/compiler/libintel_compiler.a.p/brw_nir_analyze_ubo_ranges.c.o
[835/2837] Compiling C++ object src/intel/compiler/libintel_compiler.a.p/brw_fs_sel_peephole.cpp.o
[836/2837] Compiling C object src/intel/compiler/libintel_compiler.a.p/brw_nir_lower_conversions.c.o
[837/2837] Compiling C object src/intel/compiler/libintel_compiler.a.p/brw_nir_lower_scoped_barriers.c.o
[838/2837] Compiling C object src/intel/compiler/libintel_compiler.a.p/brw_nir_lower_rt_intrinsics.c.o
[839/2837] Compiling C object src/intel/compiler/libintel_compiler.a.p/brw_nir_lower_cs_intrinsics.c.o
[840/2837] Compiling C object src/intel/compiler/libintel_compiler.a.p/brw_nir_attribute_workarounds.c.o
[841/2837] Compiling C object src/intel/compiler/libintel_compiler.a.p/brw_nir_lower_alpha_to_coverage.c.o
[842/2837] Compiling C object src/intel/compiler/libintel_compiler.a.p/brw_packed_float.c.o
[843/2837] Compiling C object src/amd/vulkan/libvulkan_radeon.so.p/radv_device.c.o
[844/2837] Compiling C++ object src/intel/compiler/libintel_compiler.a.p/brw_ir_performance.cpp.o
[845/2837] Compiling C object src/intel/compiler/libintel_compiler.a.p/brw_reg_type.c.o
[846/2837] Compiling C object src/intel/compiler/libintel_compiler.a.p/brw_nir_lower_intersection_shader.c.o
[847/2837] Compiling C++ object src/intel/compiler/libintel_compiler.a.p/brw_predicated_break.cpp.o
[848/2837] Compiling C object src/intel/compiler/libintel_compiler.a.p/brw_nir_lower_mem_access_bit_sizes.c.o
[849/2837] Compiling C++ object src/intel/compiler/libintel_compiler.a.p/brw_shader.cpp.o
[850/2837] Compiling C++ object src/intel/compiler/libintel_compiler.a.p/brw_schedule_instructions.cpp.o
[851/2837] Compiling C++ object src/intel/compiler/libintel_compiler.a.p/brw_fs_visitor.cpp.o
[852/2837] Compiling C object src/intel/compiler/libintel_compiler.a.p/brw_nir.c.o
[853/2837] Compiling C object src/intel/compiler/libintel_compiler.a.p/brw_nir_tcs_workarounds.c.o
[854/2837] Generating sid_tables_h with a custom command (wrapped by meson to capture output)
[855/2837] Compiling C object src/amd/common/libamd_common.a.p/meson-generated_.._gfx10_format_table.c.o
[856/2837] Compiling C object src/amd/common/libamd_common.a.p/ac_debug.c.o
[857/2837] Compiling C object src/amd/common/libamd_common.a.p/ac_shadowed_regs.c.o
[858/2837] Compiling C object src/amd/common/libamd_common.a.p/ac_binary.c.o
[859/2837] Compiling C object src/amd/common/libamd_common.a.p/ac_shader_args.c.o
[860/2837] Compiling C++ object src/intel/compiler/libintel_compiler.a.p/brw_vec4_copy_propagation.cpp.o
[861/2837] Compiling C object src/amd/common/libamd_common.a.p/ac_gpu_info.c.o
[862/2837] Compiling C object src/amd/common/libamd_common.a.p/ac_shader_util.c.o
[863/2837] Compiling C object src/amd/common/libamd_common.a.p/ac_msgpack.c.o
[864/2837] Compiling C object src/amd/common/libamd_common.a.p/ac_rtld.c.o
[865/2837] Compiling C object src/amd/common/libamd_common.a.p/ac_rgp.c.o
[866/2837] Compiling C object src/amd/common/libamd_common.a.p/ac_sqtt.c.o
[867/2837] Compiling C object src/amd/common/libamd_common.a.p/ac_rgp_elf_object_pack.c.o
[868/2837] Compiling C object src/amd/common/libamd_common.a.p/ac_surface.c.o
[869/2837] Compiling C object src/amd/common/libamd_common.a.p/ac_nir_lower_esgs_io_to_mem.c.o
[870/2837] Compiling C object src/amd/common/libamd_common.a.p/amd_family.c.o
[871/2837] Compiling C object src/amd/common/libamd_common.a.p/ac_nir_lower_tess_io_to_mem.c.o
[872/2837] Compiling C++ object src/intel/compiler/libintel_compiler.a.p/brw_vec4_cmod_propagation.cpp.o
[873/2837] Linking static target src/amd/common/libamd_common.a
[874/2837] Compiling C object src/intel/compiler/libintel_compiler.a.p/brw_nir_rt.c.o
[875/2837] Compiling C object src/intel/compiler/libintel_compiler.a.p/brw_nir_clamp_image_1d_2d_array_sizes.c.o
[876/2837] Compiling C++ object src/intel/compiler/libintel_compiler.a.p/brw_vec4_cse.cpp.o
[877/2837] Compiling C++ object src/intel/compiler/libintel_compiler.a.p/brw_fs_nir.cpp.o
[878/2837] Linking target src/amd/common/ac_surface_modifier_test
[879/2837] Linking target src/amd/common/ac_surface_meta_address_test
[880/2837] Compiling C++ object src/intel/compiler/libintel_compiler.a.p/brw_vec4_gs_visitor.cpp.o
[881/2837] Compiling C++ object src/intel/compiler/libintel_compiler.a.p/brw_vec4_dead_code_eliminate.cpp.o
[882/2837] Compiling C++ object src/intel/compiler/libintel_compiler.a.p/brw_vec4_live_variables.cpp.o
[883/2837] Compiling C++ object src/intel/compiler/libintel_compiler.a.p/brw_vec4_gs_nir.cpp.o
[884/2837] Compiling C object src/intel/compiler/libintel_compiler.a.p/brw_vue_map.c.o
[885/2837] Compiling C++ object src/intel/compiler/libintel_compiler.a.p/brw_vec4_reg_allocate.cpp.o
[886/2837] Compiling C++ object src/intel/compiler/libintel_compiler.a.p/brw_vec4_surface_builder.cpp.o
[887/2837] Compiling C++ object src/intel/compiler/libintel_compiler.a.p/brw_wm_iz.cpp.o
[888/2837] Compiling C object src/gallium/tests/graw/graw-fs-fragcoord.p/fs-fragcoord.c.o
[889/2837] Compiling C++ object src/intel/compiler/libintel_compiler.a.p/brw_vec4_tes.cpp.o
[890/2837] Compiling C object src/gallium/tests/graw/graw-fs-write-z.p/fs-write-z.c.o
[891/2837] Compiling C++ object src/intel/compiler/libintel_compiler.a.p/brw_vec4_tcs.cpp.o
[892/2837] Compiling C++ object src/intel/compiler/libintel_compiler.a.p/brw_vec4_vs_visitor.cpp.o
[893/2837] Compiling C object src/intel/compiler/libintel_compiler.a.p/brw_nir_lower_image_load_store.c.o
[894/2837] Compiling C++ object src/intel/compiler/libintel_compiler.a.p/gfx6_gs_visitor.cpp.o
[895/2837] Compiling C++ object src/intel/compiler/libintel_compiler.a.p/brw_vec4.cpp.o
[896/2837] Compiling C object src/intel/tools/libaub.a.p/aub_read.c.o
[897/2837] Compiling C++ object src/intel/compiler/eu_compact.p/test_eu_compact.cpp.o
[898/2837] Compiling C object src/intel/tools/aubinator.p/aubinator.c.o
[899/2837] Compiling C object src/intel/tools/libaub.a.p/aub_mem.c.o
[900/2837] Compiling C++ object src/intel/compiler/vf_float_conversions.p/test_vf_float_conversions.cpp.o
[901/2837] Linking static target src/intel/tools/libaub.a
[902/2837] Compiling C++ object src/intel/compiler/libintel_compiler.a.p/brw_vec4_visitor.cpp.o
[903/2837] Compiling C object src/intel/tools/aubinator_error_decode.p/aubinator_error_decode.c.o
[904/2837] Generating intel-perf-sources with a custom command
[905/2837] Compiling C object src/intel/tools/libintel_sanitize_gpu.so.p/intel_sanitize_gpu.c.o
[906/2837] Compiling C object src/intel/tools/intel_error2aub.p/error2aub.c.o
[907/2837] Compiling C++ object src/intel/compiler/libintel_compiler.a.p/brw_vec4_nir.cpp.o
[908/2837] Compiling C object src/intel/tools/intel_error2aub.p/aub_write.c.o
[909/2837] Compiling C object src/intel/tools/i965_disasm.p/i965_disasm.c.o
[910/2837] Compiling C object src/intel/perf/libintel_perf.a.p/intel_perf_mdapi.c.o
[911/2837] Linking target src/intel/tools/intel_error2aub
[912/2837] Linking target src/intel/tools/libintel_sanitize_gpu.so
[913/2837] Compiling C++ object src/intel/tools/imgui/libintel_imgui_gtk.a.p/imgui_impl_gtk3.cpp.o
[914/2837] Compiling C++ object src/intel/tools/imgui/libintel_imgui_gtk.a.p/imgui_impl_opengl3.cpp.o
[915/2837] Linking static target src/intel/tools/imgui/libintel_imgui_gtk.a
[916/2837] Linking target src/amd/vulkan/libvulkan_radeon.so
[917/2837] Compiling C object src/intel/tools/libintel_dump_gpu.so.p/aub_write.c.o
[918/2837] Compiling C++ object src/intel/compiler/libintel_compiler.a.p/brw_fs.cpp.o
[919/2837] Generating i965_lex.yy.c with a custom command
[920/2837] Compiling C++ object src/intel/compiler/eu_validate.p/test_eu_validate.cpp.o
FAILED: src/intel/compiler/eu_validate.p/test_eu_validate.cpp.o 
ccache g++ -Isrc/intel/compiler/eu_validate.p -Isrc/intel/compiler -I../src/intel/compiler -Iinclude -I../include -Isrc -I../src -Isrc/mapi -I../src/mapi -Isrc/mesa -I../src/mesa -I../src/gallium/include -Isrc/intel -I../src/intel -Isrc/compiler/nir -I../src/compiler/nir -Isrc/util -I../src/util -Isrc/compiler -I/usr/include/valgrind -fdiagnostics-color=always -pipe -D_FILE_OFFSET_BITS=64 -Wall -Winvalid-pch -Wnon-virtual-dtor -std=c++14 -O2 -g -ffunction-sections -fdata-sections -D__STDC_CONSTANT_MACROS -D__STDC_FORMAT_MACROS -D__STDC_LIMIT_MACROS '-DPACKAGE_VERSION="21.1.0-devel"' '-DPACKAGE_BUGREPORT="https://gitlab.freedesktop.org/mesa/mesa/-/issues"' -DUSE_ELF_TLS -DHAVE_ST_VDPAU -DENABLE_ST_OMX_BELLAGIO=1 -DENABLE_ST_OMX_TIZONIA=0 -DHAVE_X11_PLATFORM -DHAVE_XCB_PLATFORM -DGLX_INDIRECT_RENDERING -DGLX_DIRECT_RENDERING -DGLX_USE_DRM -DHAVE_DRM_PLATFORM -DENABLE_SHADER_CACHE -DHAVE___BUILTIN_BSWAP32 -DHAVE___BUILTIN_BSWAP64 -DHAVE___BUILTIN_CLZ -DHAVE___BUILTIN_CLZLL -DHAVE___BUILTIN_CTZ -DHAVE___BUILTIN_EXPECT -DHAVE___BUILTIN_FFS -DHAVE___BUILTIN_FFSLL -DHAVE___BUILTIN_POPCOUNT -DHAVE___BUILTIN_POPCOUNTLL -DHAVE___BUILTIN_UNREACHABLE -DHAVE_FUNC_ATTRIBUTE_CONST -DHAVE_FUNC_ATTRIBUTE_FLATTEN -DHAVE_FUNC_ATTRIBUTE_MALLOC -DHAVE_FUNC_ATTRIBUTE_PURE -DHAVE_FUNC_ATTRIBUTE_UNUSED -DHAVE_FUNC_ATTRIBUTE_WARN_UNUSED_RESULT -DHAVE_FUNC_ATTRIBUTE_WEAK -DHAVE_FUNC_ATTRIBUTE_FORMAT -DHAVE_FUNC_ATTRIBUTE_PACKED -DHAVE_FUNC_ATTRIBUTE_RETURNS_NONNULL -DHAVE_FUNC_ATTRIBUTE_ALIAS -DHAVE_FUNC_ATTRIBUTE_NORETURN -DHAVE_FUNC_ATTRIBUTE_VISIBILITY -DHAVE_UINT128 -D_GNU_SOURCE -DUSE_SSE41 -DUSE_GCC_ATOMIC_BUILTINS -DUSE_X86_64_ASM -DMAJOR_IN_SYSMACROS -DHAVE_LINUX_FUTEX_H -DHAVE_ENDIAN_H -DHAVE_DLFCN_H -DHAVE_EXECINFO_H -DHAVE_SYS_SHM_H -DHAVE_CET_H -DHAVE_STRTOF -DHAVE_MKOSTEMP -DHAVE_TIMESPEC_GET -DHAVE_MEMFD_CREATE -DHAVE_RANDOM_R -DHAVE_FLOCK -DHAVE_STRTOK_R -DHAVE_GETRANDOM -DHAVE_PROGRAM_INVOCATION_NAME -DHAVE_POSIX_MEMALIGN -DHAVE_DIRENT_D_TYPE -DHAVE_STRTOD_L -DHAVE_DLADDR -DHAVE_DL_ITERATE_PHDR -DHAVE_ZLIB -DHAVE_ZSTD -DHAVE_COMPRESSION -DHAVE_PTHREAD -DHAVE_PTHREAD_SETAFFINITY -DHAVE_LIBDRM -DLLVM_AVAILABLE '-DMESA_LLVM_VERSION_STRING="9.0.1"' -DLLVM_IS_SHARED=1 -DDRAW_LLVM_AVAILABLE -DHAVE_VALGRIND -DHAVE_WAYLAND_PLATFORM -DWL_HIDE_DEPRECATED -DHAVE_OPENMP -DHAVE_DRI3 -DHAVE_DRI3_MODIFIERS -Werror=return-type -Werror=empty-body -Wno-non-virtual-dtor -Wno-missing-field-initializers -Wno-format-truncation -fno-math-errno -fno-trapping-math -flifetime-dse=1 -Werror=format -Wformat-security -pthread -isystem../src/gtest/include -MD -MQ src/intel/compiler/eu_validate.p/test_eu_validate.cpp.o -MF src/intel/compiler/eu_validate.p/test_eu_validate.cpp.o.d -o src/intel/compiler/eu_validate.p/test_eu_validate.cpp.o -c ../src/intel/compiler/test_eu_validate.cpp
In file included from ../src/gtest/include/gtest/gtest.h:67,
                 from ../src/intel/compiler/test_eu_validate.cpp:24:
../src/intel/compiler/test_eu_validate.cpp: In function ‘std::string gtest_eu_assemblyvalidation_test_EvalGenerateName_(const testing::TestParamInfo<intel_gfx_info>&)’:
../src/intel/compiler/test_eu_validate.cpp:95:25: error: ‘gfx_name’ was not declared in this scope; did you mean ‘gfx_names’?
   95 |                         gfx_name());
      |                         ^~~~~~~~
../src/intel/compiler/test_eu_validate.cpp:93:1: error: template argument 1 is invalid
   93 | INSTANTIATE_TEST_CASE_P(eu_assembly, validation_test,
      | ^~~~~~~~~~~~~~~~~~~~~~~
../src/intel/compiler/test_eu_validate.cpp:95:25: error: ‘gfx_name’ was not declared in this scope; did you mean ‘gfx_names’?
   95 |                         gfx_name());
      |                         ^~~~~~~~
[921/2837] Compiling C object src/intel/tools/libintel_noop_drm_shim.so.p/intel_noop_drm_shim.c.o
[922/2837] Compiling C object src/intel/tools/libintel_dump_gpu.so.p/intel_dump_gpu.c.o
[923/2837] Compiling C object src/intel/perf/libintel_perf.a.p/intel_perf_query.c.o
[924/2837] Generating anv_entrypoints with a custom command
[925/2837] Compiling C object src/intel/perf/libintel_perf.a.p/intel_perf.c.o
[926/2837] Compiling C++ object src/intel/compiler/vec4_copy_propagation.p/test_vec4_copy_propagation.cpp.o
[927/2837] Compiling C++ object src/intel/compiler/vec4_dead_code_eliminate.p/test_vec4_dead_code_eliminate.cpp.o
[928/2837] Compiling C++ object src/intel/compiler/libintel_compiler.a.p/brw_vec4_generator.cpp.o
[929/2837] Generating i965_gram.tab.[ch] with a custom command
[930/2837] Compiling C++ object src/intel/tools/aubinator_viewer.p/aubinator_viewer_decoder.cpp.o
[931/2837] Compiling C++ object src/intel/compiler/vec4_register_coalesce.p/test_vec4_register_coalesce.cpp.o
[932/2837] Compiling C++ object src/intel/tools/aubinator_viewer.p/aubinator_viewer.cpp.o
[933/2837] Compiling C++ object src/intel/compiler/fs_saturate_propagation.p/test_fs_saturate_propagation.cpp.o
[934/2837] Compiling C++ object src/intel/compiler/fs_scoreboard.p/test_fs_scoreboard.cpp.o
[935/2837] Compiling C++ object src/intel/compiler/vec4_cmod_propagation.p/test_vec4_cmod_propagation.cpp.o
[936/2837] Compiling C++ object src/intel/compiler/fs_cmod_propagation.p/test_fs_cmod_propagation.cpp.o
[937/2837] Compiling C object src/intel/perf/libintel_perf.a.p/meson-generated_.._intel_perf_metrics.c.o
ninja: build stopped: subcommand failed.
ERROR: command failed
ERROR: creating a failing test: mesa-meson-buildtest : Command '['ninja', '-j', '18', '-C', '/home/jenkins/workspace/Leeroy_3/repos/mesa/build_mesa-buildtest_m64']' returned non-zero exit status 1.
 rsync -rlpD --exclude='*.o' --exclude='*.a' /tmp/build_root/test otc-mesa-ci.local::nfs/results/aphogat_internal/042252ed0827fd481539aa7ae11a04b6/percheckin
 cp -a /tmp/build_root/m64/../test /home/jenkins/workspace/Leeroy_3
+ exit 0
Set build name.
New build name is 'mesa-buildtest-aphogat_internal-m64-builder'
Variable with name 'BUILD_DISPLAY_NAME' already exists, current value: 'mesa-buildtest-aphogat_internal-m64-builder', new value: 'mesa-buildtest-aphogat_internal-m64-builder'
[WARNINGS] Parsing warnings in console log with parser GNU Make + GNU C Compiler (gcc)
[WARNINGS] Computing warning deltas based on reference build mesa-aphogat_internal-m64-builder
Performing Post build task...
Match found for :python : True
Logical operation result is TRUE
Running script  : rm -rf /tmp/jenkins/${BUILD_NUMBER}
[Leeroy_3] $ /bin/sh -xe /tmp/hudson4615061753669590732.sh
+ rm -rf /tmp/jenkins/5732861
POST BUILD TASK : SUCCESS
END OF POST BUILD TASK : 0
[xUnit] [INFO] - Starting to record.
[xUnit] [INFO] - Processing JUnit
[xUnit] [INFO] - [JUnit] - 1 test report file(s) were found with the pattern 'test/piglit*xml' relative to '/home/jenkins/workspace/Leeroy_3' for the testing framework 'JUnit'.
[xUnit] [INFO] - Processing GoogleTest-1.6
[xUnit] [INFO] - [GoogleTest-1.6] - No test report file(s) were found with the pattern 'test/gtest*xml' relative to '/home/jenkins/workspace/Leeroy_3' for the testing framework 'GoogleTest-1.6'.  Did you enter a pattern relative to the correct directory?  Did you generate the result report(s) for 'GoogleTest-1.6'?
[xUnit] [WARNING] - No test reports found for the metric 'GoogleTest' with the resolved pattern 'test/gtest*xml'.
[xUnit] [INFO] - Skipping the metric tool processing.
[xUnit] [INFO] - Check 'Failed Tests' threshold.
[xUnit] [INFO] - The total number of tests for this category exceeds the specified 'unstable' threshold value.
[xUnit] [INFO] - Setting the build status to UNSTABLE
[xUnit] [INFO] - Stopping recording.
Build step 'Publish xUnit test result report' changed build result to UNSTABLE
Collecting metadata...
Metadata collection done.
Finished: UNSTABLE