log: vulkancts_m64_debug_builder.log

Started by remote host ::1
Building remotely on builder-01 (builder) in workspace /home/jenkins/workspace/Leeroy
 > git rev-parse --is-inside-work-tree # timeout=10
Fetching changes from 5 remote Git repositories
 > git config remote.craftyguy.url https://gitlab.freedesktop.org/craftyguy/mesa_jenkins.git # timeout=10
Pruning obsolete local branches
Fetching upstream changes from https://gitlab.freedesktop.org/craftyguy/mesa_jenkins.git
 > git --version # timeout=10
Setting http proxy: proxy.jf.intel.com:911
 > git fetch --tags --progress https://gitlab.freedesktop.org/craftyguy/mesa_jenkins.git +refs/heads/*:refs/remotes/craftyguy/* --prune
 > git config remote.dcbaker.url git://github.com/dcbaker/mesa_jenkins # timeout=10
Pruning obsolete local branches
Fetching upstream changes from git://github.com/dcbaker/mesa_jenkins
 > git fetch --tags --progress git://github.com/dcbaker/mesa_jenkins +refs/heads/*:refs/remotes/dcbaker/* --prune
 > git config remote.local.url git://otc-mesa-ci.local/git/mesa_jenkins # timeout=10
Pruning obsolete local branches
Fetching upstream changes from git://otc-mesa-ci.local/git/mesa_jenkins
 > git fetch --tags --progress git://otc-mesa-ci.local/git/mesa_jenkins +refs/heads/*:refs/remotes/local/* --prune
 > git config remote.majanes.url https://gitlab.freedesktop.org/majanes/mesa_jenkins.git # timeout=10
Pruning obsolete local branches
Fetching upstream changes from https://gitlab.freedesktop.org/majanes/mesa_jenkins.git
Setting http proxy: proxy.jf.intel.com:911
 > git fetch --tags --progress https://gitlab.freedesktop.org/majanes/mesa_jenkins.git +refs/heads/*:refs/remotes/majanes/* --prune
 > git config remote.origin.url https://gitlab.freedesktop.org/Mesa_CI/mesa_jenkins.git # timeout=10
Pruning obsolete local branches
Fetching upstream changes from https://gitlab.freedesktop.org/Mesa_CI/mesa_jenkins.git
Setting http proxy: proxy.jf.intel.com:911
 > git fetch --tags --progress https://gitlab.freedesktop.org/Mesa_CI/mesa_jenkins.git +refs/*:refs/remotes/origin/* --prune
 > git rev-parse d60ee5d10e4e1083ad363a30f27b2cff40f5ef7e^{commit} # timeout=10
Checking out Revision d60ee5d10e4e1083ad363a30f27b2cff40f5ef7e (detached)
 > git config core.sparsecheckout # timeout=10
 > git checkout -f d60ee5d10e4e1083ad363a30f27b2cff40f5ef7e
 > git rev-list d60ee5d10e4e1083ad363a30f27b2cff40f5ef7e # timeout=10
Set build name.
New build name is 'vulkancts-apinheiro-m64-builder'
[Leeroy] $ /bin/sh -xe /tmp/hudson872745036088053631.sh
+ echo project:vulkancts arch:m64 result_path:/mnt/jenkins/results/apinheiro/6540fbe7919138814afc404e8aa345fd/percheckin config:debug type:percheckin revision:crucible=4557aa9 cts=8b0e94d8b deqp=f2cd73c61 drm=4735ca71 glcts=60a7f1b15 mesa=833680d8e0e mesa_ci=c01d8a26 piglit=9419df6841 skqp=2441c924425 vkrunner=770cb64 vulkancts=878eb5739 waffle=1ded029 hardware:builder hash:63dd19a8d92e2515cef9c2df9b223a88
project:vulkancts arch:m64 result_path:/mnt/jenkins/results/apinheiro/6540fbe7919138814afc404e8aa345fd/percheckin config:debug type:percheckin revision:crucible=4557aa9 cts=8b0e94d8b deqp=f2cd73c61 drm=4735ca71 glcts=60a7f1b15 mesa=833680d8e0e mesa_ci=c01d8a26 piglit=9419df6841 skqp=2441c924425 vkrunner=770cb64 vulkancts=878eb5739 waffle=1ded029 hardware:builder hash:63dd19a8d92e2515cef9c2df9b223a88
+ python -u fetch_sources.py --project=vulkancts crucible=4557aa9 cts=8b0e94d8b deqp=f2cd73c61 drm=4735ca71 glcts=60a7f1b15 mesa=833680d8e0e mesa_ci=c01d8a26 piglit=9419df6841 skqp=2441c924425 vkrunner=770cb64 vulkancts=878eb5739 waffle=1ded029
Checking out specified commit (try 1/15)
+ ls /mnt/jenkins/results
+ mkdir -p /tmp/jenkins/2987384
+ [ builder = builder ]
+ unshare -m -r /bin/bash -c 
mount -o bind /tmp/jenkins/2987384 /tmp
unset revision
python -u vulkancts/build.py --arch m64 --result_path /mnt/jenkins/results/apinheiro/6540fbe7919138814afc404e8aa345fd/percheckin --config debug --type percheckin --hardware builder --action clean,build,test --shard 0 --env "" 

INFO: starting timer at: 1552658893.45, time remaining is: 1499.99998903
 cp -al /tmp/build_root /tmp/orig_build_root
 git clean -xfd
Removing CMakeLists.txt.orig
Removing CMakeLists.txt.rej
Removing build_m64/
Removing external/fetch_sources.pyc
Skipping repository external/glslang/src/
Skipping repository external/spirv-headers/src
Skipping repository external/spirv-tools/src/
Skipping repository external/vkrunner/src/
Removing external/vulkancts/modules/vulkan/vktTestPackage.cpp.orig
Removing external/vulkancts/modules/vulkan/vktTestPackage.cpp.rej
Removing scripts/build/__init__.pyc
Removing scripts/build/common.pyc
 git reset --hard HEAD
Checking out files:  61% (2681/4364)   
Checking out files:  61% (2693/4364)   
Checking out files:  62% (2706/4364)   
Checking out files:  63% (2750/4364)   
Checking out files:  64% (2793/4364)   
Checking out files:  65% (2837/4364)   
Checking out files:  66% (2881/4364)   
Checking out files:  67% (2924/4364)   
Checking out files:  68% (2968/4364)   
Checking out files:  69% (3012/4364)   
Checking out files:  70% (3055/4364)   
Checking out files:  71% (3099/4364)   
Checking out files:  72% (3143/4364)   
Checking out files:  73% (3186/4364)   
Checking out files:  74% (3230/4364)   
Checking out files:  75% (3273/4364)   
Checking out files:  76% (3317/4364)   
Checking out files:  77% (3361/4364)   
Checking out files:  78% (3404/4364)   
Checking out files:  79% (3448/4364)   
Checking out files:  80% (3492/4364)   
Checking out files:  81% (3535/4364)   
Checking out files:  82% (3579/4364)   
Checking out files:  83% (3623/4364)   
Checking out files:  84% (3666/4364)   
Checking out files:  85% (3710/4364)   
Checking out files:  86% (3754/4364)   
Checking out files:  86% (3765/4364)   
Checking out files:  87% (3797/4364)   
Checking out files:  88% (3841/4364)   
Checking out files:  89% (3884/4364)   
Checking out files:  90% (3928/4364)   
Checking out files:  91% (3972/4364)   
Checking out files:  92% (4015/4364)   
Checking out files:  93% (4059/4364)   
Checking out files:  94% (4103/4364)   
Checking out files:  95% (4146/4364)   
Checking out files:  96% (4190/4364)   
Checking out files:  97% (4234/4364)   
Checking out files:  98% (4277/4364)   
Checking out files:  99% (4321/4364)   
Checking out files: 100% (4364/4364)   
Checking out files: 100% (4364/4364), done.
HEAD is now at 878eb5739 Merge vk-gl-cts/vulkan-cts-1.1.2 into vk-gl-cts/vulkan-cts-1.1.3
 patch -p1 CMakeLists.txt /home/jenkins/workspace/Leeroy/vulkancts//0001-Fix-PNG.patch
patching file CMakeLists.txt
Hunk #1 FAILED at 66.
1 out of 1 hunk FAILED -- saving rejects to file CMakeLists.txt.rej
ERROR: command failed
WARN: failed to apply PNG patch
 patch -p1 external/vulkancts/modules/vulkan/vktTestPackage.cpp /home/jenkins/workspace/Leeroy/vulkancts//0002-Attempt-to-load-prebuilt-spirv-from-cache.patch
patching file external/vulkancts/modules/vulkan/vktTestPackage.cpp
Hunk #1 FAILED at 92.
1 out of 1 hunk FAILED -- saving rejects to file external/vulkancts/modules/vulkan/vktTestPackage.cpp.rej
ERROR: command failed
WARN: failed to apply prebuilt patch
 git am /home/jenkins/workspace/Leeroy/vulkancts//0003-renderdoc.patch
fatal: previous rebase directory .git/rebase-apply still exists but mbox given.
ERROR: command failed
WARN: failed to apply prebuilt patch
 git clean -xfd
 git reset --hard HEAD
HEAD is now at 17da9f8 Reserve tokens for float controls and no integer wrapping:
 git clean -xfd
 git reset --hard HEAD
HEAD is now at e0292c26 Add --target-env flag to spirv-opt (#2216)
 git clean -xfd
 git reset --hard HEAD
HEAD is now at 28982233 Bump revision.
 git clean -xfd
 git reset --hard HEAD
HEAD is now at 2787f7c vkrunner: add stddef.h header for offsetof()
 cmake -GNinja -DCMAKE_BUILD_TYPE=Release -DCMAKE_C_COMPILER_LAUNCHER=ccache -DCMAKE_CXX_COMPILER_LAUNCHER=ccache -DCMAKE_C_FLAGS=-m64 -DCMAKE_CXX_FLAGS=-m64 -DCMAKE_C_COMPILER=clang -DCMAKE_CXX_COMPILER=clang++ -DCMAKE_INSTALL_PREFIX:PATH=/tmp/build_root/m64 ..
-- Found Git: /usr/local/bin/git (found version "2.16.1") 
-- Found PythonInterp: /usr/bin/python2 (found suitable version "2.7.14", minimum required is "2") 
-- The C compiler identification is Clang 6.0.1
-- The CXX compiler identification is Clang 6.0.1
-- Check for working C compiler: /usr/bin/clang
-- Check for working C compiler: /usr/bin/clang -- works
-- Detecting C compiler ABI info
-- Detecting C compiler ABI info - done
-- Detecting C compile features
-- Detecting C compile features - done
-- Check for working CXX compiler: /usr/bin/clang++
-- Check for working CXX compiler: /usr/bin/clang++ -- works
-- Detecting CXX compiler ABI info
-- Detecting CXX compiler ABI info - done
-- Detecting CXX compile features
-- Detecting CXX compile features - done
-- DE_OS          = DE_OS_UNIX
-- DE_COMPILER    = DE_COMPILER_CLANG
-- DE_CPU         = DE_CPU_X86_64
-- DE_PTR_SIZE    = 8
-- DE_DEBUG       = 0
*** Default target
-- Looking for XOpenDisplay in /usr/lib/x86_64-linux-gnu/libX11.so;/usr/lib/x86_64-linux-gnu/libXext.so
-- Looking for XOpenDisplay in /usr/lib/x86_64-linux-gnu/libX11.so;/usr/lib/x86_64-linux-gnu/libXext.so - found
-- Looking for gethostbyname
-- Looking for gethostbyname - found
-- Looking for connect
-- Looking for connect - found
-- Looking for remove
-- Looking for remove - found
-- Looking for shmat
-- Looking for shmat - found
-- Looking for IceConnectionNumber in ICE
-- Looking for IceConnectionNumber in ICE - found
-- Found X11: /usr/lib/x86_64-linux-gnu/libX11.so
-- Found PkgConfig: /usr/bin/pkg-config (found version "0.29") 
-- Checking for module 'xcb'
--   Found xcb, version 1.13
-- Found XCB: xcb  
-- Found WAYLAND_CLIENT: /usr/lib/x86_64-linux-gnu/libwayland-client.so  
-- Found WAYLAND_SERVER: /usr/lib/x86_64-linux-gnu/libwayland-server.so  
-- Found WAYLAND_EGL: /usr/lib/x86_64-linux-gnu/libwayland-egl.so  
-- Found WAYLAND_CURSOR: /usr/lib/x86_64-linux-gnu/libwayland-cursor.so  
-- Found WAYLAND: /usr/lib/x86_64-linux-gnu/libwayland-client.so;/usr/lib/x86_64-linux-gnu/libwayland-server.so;/usr/lib/x86_64-linux-gnu/libwayland-egl.so;/usr/lib/x86_64-linux-gnu/libwayland-cursor.so  
-- Found ZLIB: /usr/lib/x86_64-linux-gnu/libz.so (found version "1.2.8") 
-- Found PNG: /usr/lib/x86_64-linux-gnu/libpng.so (found version "1.6.34") 
-- glslang found; building with DEQP_SUPPORT_GLSLANG
-- Google Mock was not found - tests based on that will not build
-- spirv-tools not linked - illegal SPIRV may be generated for HLSL
-- Looking for pthread.h
-- Looking for pthread.h - found
-- Looking for pthread_create
-- Looking for pthread_create - not found
-- Check if compiler accepts -pthread
-- Check if compiler accepts -pthread - yes
-- Found Threads: TRUE  
-- spirv-tools found; building with DEQP_HAVE_SPIRV_TOOLS
-- SPIRV-Tools: nosetests was not found - python support code will not be tested
-- Found PythonInterp: /usr/bin/python2 (found version "2.7.14") 
-- Performing Test HAVE_FLAG__std_c99
-- Performing Test HAVE_FLAG__std_c99 - Success
-- Performing Test HAVE_FLAG__Wno_extra
-- Performing Test HAVE_FLAG__Wno_extra - Success
-- Performing Test HAVE_FLAG__Wno_pedantic
-- Performing Test HAVE_FLAG__Wno_pedantic - Success
-- Performing Test HAVE_FLAG__Wno_conversion
-- Performing Test HAVE_FLAG__Wno_conversion - Success
-- Performing Test HAVE_FLAG__Wno_shadow
-- Performing Test HAVE_FLAG__Wno_shadow - Success
-- Check if the system is big endian
-- Searching 16 bit integer
-- Looking for sys/types.h
-- Looking for sys/types.h - found
-- Looking for stdint.h
-- Looking for stdint.h - found
-- Looking for stddef.h
-- Looking for stddef.h - found
-- Check size of unsigned short
-- Check size of unsigned short - done
-- Using unsigned short
-- Check if the system is big endian - little endian
-- Performing Test HAVE_FLAG__Wall
-- Performing Test HAVE_FLAG__Wall - Success
-- Performing Test HAVE_FLAG__Wuninitialized
-- Performing Test HAVE_FLAG__Wuninitialized - Success
-- Performing Test HAVE_FLAG__Wempty_body
-- Performing Test HAVE_FLAG__Wempty_body - Success
-- Performing Test HAVE_FLAG__Wformat
-- Performing Test HAVE_FLAG__Wformat - Success
-- Performing Test HAVE_FLAG__Wformat_security
-- Performing Test HAVE_FLAG__Wformat_security - Success
-- Performing Test HAVE_FLAG__Winit_self
-- Performing Test HAVE_FLAG__Winit_self - Success
-- Performing Test HAVE_FLAG__Wundef
-- Performing Test HAVE_FLAG__Wundef - Success
-- Performing Test HAVE_FLAG__Wvla
-- Performing Test HAVE_FLAG__Wvla - Success
-- Performing Test HAVE_FLAG__Wpointer_arith
-- Performing Test HAVE_FLAG__Wpointer_arith - Success
-- Performing Test HAVE_FLAG__Wmissing_declarations
-- Performing Test HAVE_FLAG__Wmissing_declarations - Success
-- Looking for ffs
-- Looking for ffs - found
-- Looking for ffsl
-- Looking for ffsl - found
-- DEQP_TARGET_NAME        = Default
-- DEQP_SUPPORT_GLES1      = OFF
-- DEQP_GLES1_LIBRARIES    = 
-- DEQP_GLES2_LIBRARIES    = 
-- DEQP_GLES3_LIBRARIES    = 
-- DEQP_GLES31_LIBRARIES   = 
-- DEQP_GLES32_LIBRARIES   = 
-- DEQP_SUPPORT_VG         = OFF
-- DEQP_VG_LIBRARIES       = 
-- DEQP_EGL_LIBRARIES      = /usr/lib/x86_64-linux-gnu/libEGL.so
-- DEQP_PLATFORM_LIBRARIES = /usr/lib/x86_64-linux-gnu/libwayland-client.so;/usr/lib/x86_64-linux-gnu/libwayland-server.so;/usr/lib/x86_64-linux-gnu/libwayland-egl.so;/usr/lib/x86_64-linux-gnu/libwayland-cursor.so
-- Found PythonInterp: /usr/bin/python2 (found suitable version "2.7.14", minimum required is "2.7") 
-- Using git revision as release identifier
-- DEQP_SUPPORT_GLX        = ON
-- DEQP_GTF_AVAILABLE      = OFF
-- GLCTS_GTF_SUPPORT_OPENGL = 
-- GLCTS_GTF_SUPPORT_GLES32 = 
-- GLCTS_GTF_SUPPORT_GLES31 = 
-- GLCTS_GTF_SUPPORT_GLES3  = 
-- GLCTS_GTF_SUPPORT_GLES2  = 
-- Configuring done
-- Generating done
-- Build files have been written to: /home/jenkins/workspace/Leeroy/repos/vulkancts/build_m64
 ninja vk-build-programs
[1/817] Building CXX object external/glslang/src/glslang/CMakeFiles/glslang.dir/MachineIndependent/attribute.cpp.o
[2/817] Building CXX object external/glslang/src/glslang/CMakeFiles/glslang.dir/MachineIndependent/Constant.cpp.o
[3/817] Building CXX object external/glslang/src/glslang/CMakeFiles/glslang.dir/MachineIndependent/iomapper.cpp.o
[4/817] Building CXX object external/glslang/src/glslang/CMakeFiles/glslang.dir/MachineIndependent/InfoSink.cpp.o
[5/817] Building CXX object external/glslang/src/glslang/CMakeFiles/glslang.dir/MachineIndependent/IntermTraverse.cpp.o
[6/817] Building CXX object external/glslang/src/glslang/CMakeFiles/glslang.dir/MachineIndependent/PoolAlloc.cpp.o
[7/817] Building CXX object external/glslang/src/glslang/CMakeFiles/glslang.dir/MachineIndependent/RemoveTree.cpp.o
[8/817] Building CXX object external/glslang/src/glslang/CMakeFiles/glslang.dir/MachineIndependent/SymbolTable.cpp.o
[9/817] Building CXX object external/glslang/src/glslang/CMakeFiles/glslang.dir/MachineIndependent/intermOut.cpp.o
[10/817] Building CXX object external/glslang/src/glslang/CMakeFiles/glslang.dir/MachineIndependent/reflection.cpp.o
[11/817] Building CXX object external/glslang/src/glslang/CMakeFiles/glslang.dir/MachineIndependent/preprocessor/PpAtom.cpp.o
[12/817] Building CXX object external/glslang/src/glslang/CMakeFiles/glslang.dir/MachineIndependent/preprocessor/PpTokens.cpp.o
[13/817] Building CXX object external/glslang/src/glslang/OSDependent/Unix/CMakeFiles/OSDependent.dir/ossource.cpp.o
[14/817] Building CXX object external/glslang/src/SPIRV/CMakeFiles/SPVRemapper.dir/doc.cpp.o
[15/817] Building CXX object external/glslang/src/SPIRV/CMakeFiles/SPIRV.dir/doc.cpp.o
[16/817] Building CXX object external/glslang/src/SPIRV/CMakeFiles/SPIRV.dir/SpvTools.cpp.o
[17/817] Building C object external/vkrunner/src/vkrunner/CMakeFiles/vkrunner.dir/vr-box.c.o
[18/817] Building C object external/vkrunner/src/vkrunner/CMakeFiles/vkrunner.dir/vr-buffer.c.o
[19/817] Building CXX object external/glslang/src/glslang/CMakeFiles/glslang.dir/MachineIndependent/Initialize.cpp.o
[20/817] Building CXX object external/glslang/src/glslang/CMakeFiles/glslang.dir/MachineIndependent/Intermediate.cpp.o
[21/817] Building CXX object external/glslang/src/glslang/CMakeFiles/glslang.dir/MachineIndependent/ParseContextBase.cpp.o
[22/817] Building CXX object external/glslang/src/glslang/CMakeFiles/glslang.dir/MachineIndependent/ParseHelper.cpp.o
[23/817] Building CXX object external/glslang/src/glslang/CMakeFiles/glslang.dir/MachineIndependent/ShaderLang.cpp.o
[24/817] Building CXX object external/glslang/src/glslang/CMakeFiles/glslang.dir/MachineIndependent/Versions.cpp.o
[25/817] Building CXX object external/glslang/src/glslang/CMakeFiles/glslang.dir/MachineIndependent/limits.cpp.o
[26/817] Building CXX object external/glslang/src/glslang/CMakeFiles/glslang.dir/MachineIndependent/linkValidate.cpp.o
[27/817] Building CXX object external/glslang/src/glslang/CMakeFiles/glslang.dir/MachineIndependent/parseConst.cpp.o
[28/817] Building CXX object external/glslang/src/glslang/CMakeFiles/glslang.dir/MachineIndependent/preprocessor/Pp.cpp.o
[29/817] Building CXX object external/glslang/src/glslang/CMakeFiles/glslang.dir/MachineIndependent/preprocessor/PpContext.cpp.o
[30/817] Building CXX object external/glslang/src/glslang/CMakeFiles/glslang.dir/MachineIndependent/preprocessor/PpScanner.cpp.o
[31/817] Building CXX object external/glslang/src/glslang/CMakeFiles/glslang.dir/MachineIndependent/propagateNoContraction.cpp.o
[32/817] Building CXX object external/glslang/src/glslang/CMakeFiles/glslang.dir/GenericCodeGen/CodeGen.cpp.o
[33/817] Building CXX object external/glslang/src/glslang/CMakeFiles/glslang.dir/GenericCodeGen/Link.cpp.o
[34/817] Building CXX object external/glslang/src/OGLCompilersDLL/CMakeFiles/OGLCompiler.dir/InitializeDll.cpp.o
[35/817] Building CXX object external/glslang/src/SPIRV/CMakeFiles/SPVRemapper.dir/SPVRemapper.cpp.o
[36/817] Building CXX object external/glslang/src/SPIRV/CMakeFiles/SPIRV.dir/GlslangToSpv.cpp.o
[37/817] Building CXX object external/glslang/src/SPIRV/CMakeFiles/SPIRV.dir/InReadableOrder.cpp.o
[38/817] Building CXX object external/glslang/src/SPIRV/CMakeFiles/SPIRV.dir/Logger.cpp.o
[39/817] Building CXX object external/glslang/src/SPIRV/CMakeFiles/SPIRV.dir/SpvBuilder.cpp.o
[40/817] Building CXX object external/glslang/src/SPIRV/CMakeFiles/SPIRV.dir/SpvPostProcess.cpp.o
[41/817] Building CXX object external/glslang/src/SPIRV/CMakeFiles/SPIRV.dir/disassemble.cpp.o
[42/817] Building CXX object external/glslang/src/hlsl/CMakeFiles/HLSL.dir/hlslAttributes.cpp.o
[43/817] Building CXX object external/glslang/src/hlsl/CMakeFiles/HLSL.dir/hlslParseHelper.cpp.o
[44/817] Building CXX object external/glslang/src/hlsl/CMakeFiles/HLSL.dir/hlslScanContext.cpp.o
[45/817] Building CXX object external/glslang/src/hlsl/CMakeFiles/HLSL.dir/hlslOpMap.cpp.o
[46/817] Building CXX object external/glslang/src/hlsl/CMakeFiles/HLSL.dir/hlslTokenStream.cpp.o
[47/817] Building CXX object external/glslang/src/hlsl/CMakeFiles/HLSL.dir/hlslGrammar.cpp.o
[48/817] Building CXX object external/glslang/src/hlsl/CMakeFiles/HLSL.dir/hlslParseables.cpp.o
[49/817] Building C object external/vkrunner/src/vkrunner/CMakeFiles/vkrunner.dir/vr-allocate-store.c.o
[50/817] Building C object external/vkrunner/src/vkrunner/CMakeFiles/vkrunner.dir/vr-char.c.o
[51/817] Building C object external/vkrunner/src/vkrunner/CMakeFiles/vkrunner.dir/vr-config.c.o
[52/817] Building C object external/vkrunner/src/vkrunner/CMakeFiles/vkrunner.dir/vr-context.c.o
[53/817] Building C object external/vkrunner/src/vkrunner/CMakeFiles/vkrunner.dir/vr-error-message.c.o
[54/817] Building C object external/vkrunner/src/vkrunner/CMakeFiles/vkrunner.dir/vr-executor.c.o
[55/817] Building C object external/vkrunner/src/vkrunner/CMakeFiles/vkrunner.dir/vr-feature-offsets.c.o
[56/817] Building C object external/vkrunner/src/vkrunner/CMakeFiles/vkrunner.dir/vr-flush-memory.c.o
[57/817] Building C object external/vkrunner/src/vkrunner/CMakeFiles/vkrunner.dir/vr-format.c.o
[58/817] Building C object external/vkrunner/src/vkrunner/CMakeFiles/vkrunner.dir/vr-half-float.c.o
[59/817] Building C object external/vkrunner/src/vkrunner/CMakeFiles/vkrunner.dir/vr-hex.c.o
[60/817] Building C object external/vkrunner/src/vkrunner/CMakeFiles/vkrunner.dir/vr-list.c.o
[61/817] Building C object external/vkrunner/src/vkrunner/CMakeFiles/vkrunner.dir/vr-pipeline-key.c.o
[62/817] Building C object external/vkrunner/src/vkrunner/CMakeFiles/vkrunner.dir/vr-result.c.o
[63/817] Building C object external/vkrunner/src/vkrunner/CMakeFiles/vkrunner.dir/vr-script.c.o
[64/817] Building C object external/vkrunner/src/vkrunner/CMakeFiles/vkrunner.dir/vr-source.c.o
[65/817] Building C object external/vkrunner/src/vkrunner/CMakeFiles/vkrunner.dir/vr-stream.c.o
[66/817] Building C object external/vkrunner/src/vkrunner/CMakeFiles/vkrunner.dir/vr-strtof.c.o
[67/817] Building C object external/vkrunner/src/vkrunner/CMakeFiles/vkrunner.dir/vr-temp-file.c.o
[68/817] Building C object external/vkrunner/src/vkrunner/CMakeFiles/vkrunner.dir/vr-util.c.o
[69/817] Generate info tables for GLSL extended instructions and operands vunified1.
[70/817] Generate info tables for OpenCL extended instructions and operands vunified1.
[71/817] Generate extended instruction tables for spv-amd-shader-explicit-vertex-parameter.
[72/817] Generate extended instruction tables for spv-amd-shader-trinary-minmax.
[73/817] Generate extended instruction tables for spv-amd-gcn-shader.
[74/817] Generate extended instruction tables for spv-amd-shader-ballot.
[75/817] Generate extended instruction tables for debuginfo.
[76/817] Generate language specific header for DebugInfo.
[77/817] Generate tables based on the SPIR-V XML registry.
[78/817] Update build-version.inc in the SPIRV-Tools build directory (if necessary).
[79/817] Building C object external/vkrunner/src/vkrunner/CMakeFiles/vkrunner.dir/vr-vk.c.o
[80/817] Building C object external/vkrunner/src/vkrunner/CMakeFiles/vkrunner.dir/vr-pipeline.c.o
[81/817] Building C object external/vkrunner/src/vkrunner/CMakeFiles/vkrunner.dir/vr-subprocess.c.o
[82/817] Building C object external/vkrunner/src/vkrunner/CMakeFiles/vkrunner.dir/vr-test.c.o
[83/817] Linking CXX static library external/glslang/src/glslang/OSDependent/Unix/libOSDependent.a
[84/817] Building C object external/vkrunner/src/vkrunner/CMakeFiles/vkrunner.dir/vr-tolerance.c.o
[85/817] Building C object external/vkrunner/src/vkrunner/CMakeFiles/vkrunner.dir/vr-vbo.c.o
[86/817] Building C object external/vkrunner/src/vkrunner/CMakeFiles/vkrunner.dir/vr-window.c.o
[87/817] Building C object external/vkrunner/src/vkrunner/CMakeFiles/vkrunner.dir/vr-window-format.c.o
[88/817] Building C object framework/delibs/debase/CMakeFiles/debase.dir/deDefs.c.o
[89/817] Building C object framework/delibs/debase/CMakeFiles/debase.dir/deFloat16.c.o
[90/817] Building C object framework/delibs/debase/CMakeFiles/debase.dir/deFloat16Test.c.o
[91/817] Building C object framework/delibs/debase/CMakeFiles/debase.dir/deInt32.c.o
[92/817] Building C object framework/delibs/debase/CMakeFiles/debase.dir/deInt32Test.c.o
[93/817] Building C object framework/delibs/debase/CMakeFiles/debase.dir/deMath.c.o
[94/817] Building C object framework/delibs/debase/CMakeFiles/debase.dir/deMathTest.c.o
[95/817] Building C object framework/delibs/debase/CMakeFiles/debase.dir/deMemory.c.o
[96/817] Building C object framework/delibs/debase/CMakeFiles/debase.dir/deRandom.c.o
[97/817] Building C object framework/delibs/debase/CMakeFiles/debase.dir/deString.c.o
[98/817] Building C object framework/delibs/debase/CMakeFiles/debase.dir/deSha1.c.o
[99/817] Building C object framework/delibs/depool/CMakeFiles/depool.dir/deMemPool.c.o
[100/817] Building C object framework/delibs/depool/CMakeFiles/depool.dir/dePoolArray.c.o
[101/817] Building C object framework/delibs/depool/CMakeFiles/depool.dir/dePoolHeap.c.o
[102/817] Building C object framework/delibs/depool/CMakeFiles/depool.dir/dePoolHash.c.o
[103/817] Building C object framework/delibs/depool/CMakeFiles/depool.dir/dePoolHashArray.c.o
[104/817] Building C object framework/delibs/depool/CMakeFiles/depool.dir/dePoolHashSet.c.o
[105/817] Building C object framework/delibs/depool/CMakeFiles/depool.dir/dePoolMultiSet.c.o
[106/817] Building C object framework/delibs/depool/CMakeFiles/depool.dir/dePoolSet.c.o
[107/817] Building C object framework/delibs/depool/CMakeFiles/depool.dir/dePoolStringBuilder.c.o
[108/817] Building C object framework/delibs/depool/CMakeFiles/depool.dir/dePoolTest.c.o
[109/817] Building C object framework/delibs/dethread/CMakeFiles/dethread.dir/deAtomic.c.o
[110/817] Building C object framework/delibs/dethread/CMakeFiles/dethread.dir/deSingleton.c.o
[111/817] Building C object framework/delibs/dethread/CMakeFiles/dethread.dir/deThreadTest.c.o
[112/817] Building C object framework/delibs/dethread/CMakeFiles/dethread.dir/win32/deMutexWin32.c.o
[113/817] Building C object framework/delibs/dethread/CMakeFiles/dethread.dir/win32/deSemaphoreWin32.c.o
[114/817] Building C object framework/delibs/dethread/CMakeFiles/dethread.dir/win32/deThreadWin32.c.o
[115/817] Building C object framework/delibs/dethread/CMakeFiles/dethread.dir/win32/deThreadLocalWin32.c.o
[116/817] Building C object framework/delibs/dethread/CMakeFiles/dethread.dir/unix/deMutexUnix.c.o
[117/817] Building C object framework/delibs/dethread/CMakeFiles/dethread.dir/unix/deNamedSemaphoreUnix.c.o
[118/817] Building C object framework/delibs/dethread/CMakeFiles/dethread.dir/unix/deSemaphoreUnix.c.o
[119/817] Building C object framework/delibs/dethread/CMakeFiles/dethread.dir/unix/deThreadUnix.c.o
[120/817] Building C object framework/delibs/dethread/CMakeFiles/dethread.dir/unix/deThreadLocalUnix.c.o
[121/817] Building C object framework/delibs/deutil/CMakeFiles/deutil.dir/deClock.c.o
[122/817] Building C object framework/delibs/deutil/CMakeFiles/deutil.dir/deCommandLine.c.o
[123/817] Building C object framework/delibs/deutil/CMakeFiles/deutil.dir/deDynamicLibrary.c.o
[124/817] Building C object framework/delibs/deutil/CMakeFiles/deutil.dir/deProcess.c.o
[125/817] Generate enum-string mapping for SPIR-V vunified1.
[126/817] Linking CXX static library external/glslang/src/OGLCompilersDLL/libOGLCompiler.a
[127/817] Linking CXX static library external/glslang/src/SPIRV/libSPVRemapper.a
[128/817] Building C object framework/delibs/deutil/CMakeFiles/deutil.dir/deFile.c.o
[129/817] Building C object framework/delibs/deutil/CMakeFiles/deutil.dir/deSocket.c.o
[130/817] Building C object framework/delibs/deutil/CMakeFiles/deutil.dir/deTimer.c.o
[131/817] Building C object framework/delibs/deutil/CMakeFiles/deutil.dir/deTimerTest.c.o
[132/817] Building CXX object framework/delibs/decpp/CMakeFiles/decpp.dir/deAppendList.cpp.o
[133/817] Building CXX object framework/delibs/decpp/CMakeFiles/decpp.dir/deArrayBuffer.cpp.o
[134/817] Building CXX object framework/delibs/decpp/CMakeFiles/decpp.dir/deArrayUtil.cpp.o
[135/817] Building CXX object framework/delibs/decpp/CMakeFiles/decpp.dir/deBlockBuffer.cpp.o
[136/817] Building CXX object framework/delibs/decpp/CMakeFiles/decpp.dir/deCommandLine.cpp.o
[137/817] Building CXX object framework/delibs/decpp/CMakeFiles/decpp.dir/deDefs.cpp.o
[138/817] Building CXX object framework/delibs/decpp/CMakeFiles/decpp.dir/deDirectoryIterator.cpp.o
[139/817] Building CXX object framework/delibs/decpp/CMakeFiles/decpp.dir/deDynamicLibrary.cpp.o
[140/817] Building CXX object framework/delibs/decpp/CMakeFiles/decpp.dir/deFilePath.cpp.o
[141/817] Building CXX object framework/delibs/decpp/CMakeFiles/decpp.dir/deMemPool.cpp.o
[142/817] Building CXX object framework/delibs/decpp/CMakeFiles/decpp.dir/deMeta.cpp.o
[143/817] Building CXX object framework/delibs/decpp/CMakeFiles/decpp.dir/deMutex.cpp.o
[144/817] Building CXX object framework/delibs/decpp/CMakeFiles/decpp.dir/dePoolArray.cpp.o
[145/817] Building CXX object framework/delibs/decpp/CMakeFiles/decpp.dir/dePoolString.cpp.o
[146/817] Building CXX object framework/delibs/decpp/CMakeFiles/decpp.dir/deProcess.cpp.o
[147/817] Building CXX object framework/delibs/decpp/CMakeFiles/decpp.dir/deRandom.cpp.o
[148/817] Building CXX object framework/delibs/decpp/CMakeFiles/decpp.dir/deRingBuffer.cpp.o
[149/817] Building CXX object framework/delibs/decpp/CMakeFiles/decpp.dir/deSemaphore.cpp.o
[150/817] Building CXX object framework/delibs/decpp/CMakeFiles/decpp.dir/deSTLUtil.cpp.o
[151/817] Building CXX object framework/delibs/decpp/CMakeFiles/decpp.dir/deSharedPtr.cpp.o
[152/817] Building CXX object framework/delibs/decpp/CMakeFiles/decpp.dir/deSocket.cpp.o
[153/817] Building CXX object framework/delibs/decpp/CMakeFiles/decpp.dir/deThread.cpp.o
[154/817] Building CXX object framework/delibs/decpp/CMakeFiles/decpp.dir/deThreadLocal.cpp.o
[155/817] Building CXX object framework/delibs/decpp/CMakeFiles/decpp.dir/deUniquePtr.cpp.o
[156/817] Building CXX object framework/delibs/decpp/CMakeFiles/decpp.dir/deSha1.cpp.o
[157/817] Building CXX object framework/opengl/wrapper/CMakeFiles/glwrapper.dir/glwDefs.cpp.o
[158/817] Building CXX object framework/opengl/wrapper/CMakeFiles/glwrapper.dir/glwFunctions.cpp.o
[159/817] Linking CXX static library external/glslang/src/hlsl/libHLSL.a
[160/817] Building CXX object framework/delibs/decpp/CMakeFiles/decpp.dir/deStringUtil.cpp.o
[161/817] Building CXX object framework/delibs/decpp/CMakeFiles/decpp.dir/deThreadSafeRingBuffer.cpp.o
[162/817] Building CXX object framework/delibs/decpp/CMakeFiles/decpp.dir/deSpinBarrier.cpp.o
[163/817] Building CXX object framework/opengl/wrapper/CMakeFiles/glwrapper.dir/glwInitES20Direct.cpp.o
[164/817] Building CXX object framework/opengl/wrapper/CMakeFiles/glwrapper.dir/glwInitES30Direct.cpp.o
[165/817] Building CXX object framework/opengl/wrapper/CMakeFiles/glwrapper.dir/glwInitES31Direct.cpp.o
[166/817] Building CXX object framework/opengl/wrapper/CMakeFiles/glwrapper.dir/glwInitES32Direct.cpp.o
[167/817] Building CXX object framework/opengl/wrapper/CMakeFiles/glwrapper.dir/glwWrapper.cpp.o
[168/817] Running utility command for deqp-vk-vkrunner-data
[169/817] Building CXX object framework/opengl/wrapper/CMakeFiles/glwrapper.dir/glwInitFunctions.cpp.o
[170/817] Generate info tables for SPIR-V vunified1 core instructions and operands.
[171/817] Linking C static library external/vkrunner/src/vkrunner/libvkrunner.a
[172/817] Linking C static library framework/delibs/debase/libdebase.a
[173/817] Running utility command for deqp-vk-data
[174/817] Building CXX object external/spirv-tools/spirv-tools/source/CMakeFiles/SPIRV-Tools.dir/util/bit_vector.cpp.o
[175/817] Building CXX object external/spirv-tools/spirv-tools/source/CMakeFiles/SPIRV-Tools.dir/util/parse_number.cpp.o
[176/817] Building CXX object external/spirv-tools/spirv-tools/source/CMakeFiles/SPIRV-Tools.dir/util/string_utils.cpp.o
[177/817] Building CXX object external/spirv-tools/spirv-tools/source/CMakeFiles/SPIRV-Tools.dir/parsed_operand.cpp.o
[178/817] Building CXX object external/spirv-tools/spirv-tools/source/CMakeFiles/SPIRV-Tools.dir/print.cpp.o
[179/817] Building CXX object external/spirv-tools/spirv-tools/source/CMakeFiles/SPIRV-Tools.dir/spirv_endian.cpp.o
[180/817] Building CXX object external/spirv-tools/spirv-tools/source/CMakeFiles/SPIRV-Tools.dir/spirv_optimizer_options.cpp.o
[181/817] Building CXX object external/spirv-tools/spirv-tools/source/CMakeFiles/SPIRV-Tools.dir/spirv_reducer_options.cpp.o
[182/817] Building CXX object external/spirv-tools/spirv-tools/source/CMakeFiles/SPIRV-Tools.dir/spirv_target_env.cpp.o
[183/817] Building CXX object external/spirv-tools/spirv-tools/source/CMakeFiles/SPIRV-Tools.dir/spirv_validator_options.cpp.o
[184/817] Building CXX object external/spirv-tools/spirv-tools/source/CMakeFiles/SPIRV-Tools.dir/val/validate_bitwise.cpp.o
[185/817] Building CXX object external/spirv-tools/spirv-tools/source/CMakeFiles/SPIRV-Tools.dir/val/validate_builtins.cpp.o
[186/817] Building CXX object external/spirv-tools/spirv-tools/source/CMakeFiles/SPIRV-Tools.dir/val/validate_capability.cpp.o
[187/817] Building CXX object external/spirv-tools/spirv-tools/source/CMakeFiles/SPIRV-Tools.dir/val/validate_cfg.cpp.o
[188/817] Building CXX object external/spirv-tools/spirv-tools/source/CMakeFiles/SPIRV-Tools.dir/val/validate_composites.cpp.o
[189/817] Building CXX object external/spirv-tools/spirv-tools/source/CMakeFiles/SPIRV-Tools.dir/val/validate_constants.cpp.o
[190/817] Building CXX object external/spirv-tools/spirv-tools/source/CMakeFiles/SPIRV-Tools.dir/val/validate_conversion.cpp.o
[191/817] Building CXX object external/spirv-tools/spirv-tools/source/CMakeFiles/SPIRV-Tools.dir/val/validate_datarules.cpp.o
[192/817] Building CXX object external/spirv-tools/spirv-tools/source/CMakeFiles/SPIRV-Tools.dir/val/validate_decorations.cpp.o
[193/817] Building CXX object external/spirv-tools/spirv-tools/source/CMakeFiles/SPIRV-Tools.dir/val/validate_derivatives.cpp.o
[194/817] Building CXX object external/spirv-tools/spirv-tools/source/CMakeFiles/SPIRV-Tools.dir/val/validate_extensions.cpp.o
[195/817] Building CXX object external/spirv-tools/spirv-tools/source/CMakeFiles/SPIRV-Tools.dir/val/validate_execution_limitations.cpp.o
[196/817] Building CXX object external/spirv-tools/spirv-tools/source/CMakeFiles/SPIRV-Tools.dir/val/validate_function.cpp.o
[197/817] Building CXX object external/spirv-tools/spirv-tools/source/CMakeFiles/SPIRV-Tools.dir/val/validate_debug.cpp.o
[198/817] Building CXX object external/spirv-tools/spirv-tools/source/CMakeFiles/SPIRV-Tools.dir/val/validate_id.cpp.o
[199/817] Building CXX object external/spirv-tools/spirv-tools/source/CMakeFiles/SPIRV-Tools.dir/val/validate_image.cpp.o
[200/817] Building CXX object external/spirv-tools/spirv-tools/source/CMakeFiles/SPIRV-Tools.dir/val/validate_interfaces.cpp.o
[201/817] Building CXX object external/spirv-tools/spirv-tools/source/CMakeFiles/SPIRV-Tools.dir/val/validate_instruction.cpp.o
[202/817] Building CXX object external/spirv-tools/spirv-tools/source/CMakeFiles/SPIRV-Tools.dir/val/validate_layout.cpp.o
[203/817] Building CXX object external/spirv-tools/spirv-tools/source/CMakeFiles/SPIRV-Tools.dir/val/validate_literals.cpp.o
[204/817] Building CXX object external/spirv-tools/spirv-tools/source/CMakeFiles/SPIRV-Tools.dir/val/validate_logicals.cpp.o
[205/817] Building CXX object external/spirv-tools/spirv-tools/source/CMakeFiles/SPIRV-Tools.dir/val/validate_memory.cpp.o
[206/817] Building CXX object external/spirv-tools/spirv-tools/source/CMakeFiles/SPIRV-Tools.dir/val/validate_memory_semantics.cpp.o
[207/817] Building CXX object external/spirv-tools/spirv-tools/source/CMakeFiles/SPIRV-Tools.dir/val/validate_mode_setting.cpp.o
[208/817] Building CXX object external/spirv-tools/spirv-tools/source/CMakeFiles/SPIRV-Tools.dir/val/validate_non_uniform.cpp.o
[209/817] Building CXX object external/spirv-tools/spirv-tools/source/CMakeFiles/SPIRV-Tools.dir/val/validate_primitives.cpp.o
[210/817] Building CXX object external/spirv-tools/spirv-tools/source/CMakeFiles/SPIRV-Tools.dir/val/validate_scopes.cpp.o
[211/817] Building CXX object external/spirv-tools/spirv-tools/source/CMakeFiles/SPIRV-Tools.dir/val/validate_type.cpp.o
[212/817] Building CXX object external/spirv-tools/spirv-tools/source/CMakeFiles/SPIRV-Tools.dir/val/basic_block.cpp.o
[213/817] Building CXX object external/spirv-tools/spirv-tools/source/CMakeFiles/SPIRV-Tools.dir/val/construct.cpp.o
[214/817] Building CXX object external/spirv-tools/spirv-tools/source/CMakeFiles/SPIRV-Tools.dir/val/instruction.cpp.o
[215/817] Building CXX object external/spirv-tools/spirv-tools/source/CMakeFiles/SPIRV-Tools.dir/util/timer.cpp.o
[216/817] Generating qpReleaseInfo.inl
[217/817] Building CXX object external/spirv-tools/spirv-tools/source/CMakeFiles/SPIRV-Tools.dir/val/function.cpp.o
[218/817] Building CXX object external/spirv-tools/spirv-tools/source/CMakeFiles/SPIRV-Tools.dir/val/validation_state.cpp.o
[219/817] Building CXX object external/spirv-tools/spirv-tools/source/opt/CMakeFiles/SPIRV-Tools-opt.dir/aggressive_dead_code_elim_pass.cpp.o
[220/817] Building CXX object external/spirv-tools/spirv-tools/source/opt/CMakeFiles/SPIRV-Tools-opt.dir/basic_block.cpp.o
[221/817] Building CXX object external/spirv-tools/spirv-tools/source/opt/CMakeFiles/SPIRV-Tools-opt.dir/block_merge_pass.cpp.o
[222/817] Building CXX object external/spirv-tools/spirv-tools/source/opt/CMakeFiles/SPIRV-Tools-opt.dir/build_module.cpp.o
[223/817] Building CXX object external/spirv-tools/spirv-tools/source/opt/CMakeFiles/SPIRV-Tools-opt.dir/ccp_pass.cpp.o
[224/817] Building CXX object external/spirv-tools/spirv-tools/source/opt/CMakeFiles/SPIRV-Tools-opt.dir/cfg_cleanup_pass.cpp.o
[225/817] Building CXX object external/spirv-tools/spirv-tools/source/opt/CMakeFiles/SPIRV-Tools-opt.dir/cfg.cpp.o
[226/817] Building CXX object external/spirv-tools/spirv-tools/source/opt/CMakeFiles/SPIRV-Tools-opt.dir/combine_access_chains.cpp.o
[227/817] Building CXX object external/spirv-tools/spirv-tools/source/opt/CMakeFiles/SPIRV-Tools-opt.dir/common_uniform_elim_pass.cpp.o
[228/817] Building CXX object external/spirv-tools/spirv-tools/source/opt/CMakeFiles/SPIRV-Tools-opt.dir/compact_ids_pass.cpp.o
[229/817] Building CXX object external/spirv-tools/spirv-tools/source/opt/CMakeFiles/SPIRV-Tools-opt.dir/composite.cpp.o
[230/817] Building CXX object external/spirv-tools/spirv-tools/source/opt/CMakeFiles/SPIRV-Tools-opt.dir/const_folding_rules.cpp.o
[231/817] Building CXX object external/spirv-tools/spirv-tools/source/opt/CMakeFiles/SPIRV-Tools-opt.dir/constants.cpp.o
[232/817] Building CXX object external/spirv-tools/spirv-tools/source/opt/CMakeFiles/SPIRV-Tools-opt.dir/copy_prop_arrays.cpp.o
[233/817] Building CXX object external/spirv-tools/spirv-tools/source/opt/CMakeFiles/SPIRV-Tools-opt.dir/dead_branch_elim_pass.cpp.o
[234/817] Building CXX object external/spirv-tools/spirv-tools/source/opt/CMakeFiles/SPIRV-Tools-opt.dir/dead_insert_elim_pass.cpp.o
[235/817] Building CXX object external/spirv-tools/spirv-tools/source/opt/CMakeFiles/SPIRV-Tools-opt.dir/dead_variable_elimination.cpp.o
[236/817] Building CXX object external/spirv-tools/spirv-tools/source/opt/CMakeFiles/SPIRV-Tools-opt.dir/decoration_manager.cpp.o
[237/817] Building CXX object external/spirv-tools/spirv-tools/source/opt/CMakeFiles/SPIRV-Tools-opt.dir/def_use_manager.cpp.o
[238/817] Building CXX object external/spirv-tools/spirv-tools/source/opt/CMakeFiles/SPIRV-Tools-opt.dir/dominator_analysis.cpp.o
[239/817] Building CXX object external/spirv-tools/spirv-tools/source/opt/CMakeFiles/SPIRV-Tools-opt.dir/dominator_tree.cpp.o
[240/817] Building CXX object external/spirv-tools/spirv-tools/source/opt/CMakeFiles/SPIRV-Tools-opt.dir/eliminate_dead_constant_pass.cpp.o
[241/817] Building CXX object external/spirv-tools/spirv-tools/source/opt/CMakeFiles/SPIRV-Tools-opt.dir/eliminate_dead_functions_pass.cpp.o
[242/817] Building CXX object external/spirv-tools/spirv-tools/source/opt/CMakeFiles/SPIRV-Tools-opt.dir/feature_manager.cpp.o
[243/817] Building CXX object external/spirv-tools/spirv-tools/source/opt/CMakeFiles/SPIRV-Tools-opt.dir/flatten_decoration_pass.cpp.o
[244/817] Building CXX object external/spirv-tools/spirv-tools/source/opt/CMakeFiles/SPIRV-Tools-opt.dir/fold.cpp.o
[245/817] Building CXX object external/spirv-tools/spirv-tools/source/opt/CMakeFiles/SPIRV-Tools-opt.dir/folding_rules.cpp.o
[246/817] Building CXX object external/spirv-tools/spirv-tools/source/opt/CMakeFiles/SPIRV-Tools-opt.dir/instruction_list.cpp.o
[247/817] Building CXX object external/spirv-tools/spirv-tools/source/CMakeFiles/SPIRV-Tools.dir/software_version.cpp.o
[248/817] Building CXX object external/spirv-tools/spirv-tools/source/opt/CMakeFiles/SPIRV-Tools-opt.dir/fold_spec_constant_op_and_composite_pass.cpp.o
[249/817] Building CXX object external/spirv-tools/spirv-tools/source/opt/CMakeFiles/SPIRV-Tools-opt.dir/freeze_spec_constant_value_pass.cpp.o
[250/817] Building CXX object external/spirv-tools/spirv-tools/source/opt/CMakeFiles/SPIRV-Tools-opt.dir/function.cpp.o
[251/817] Building CXX object external/spirv-tools/spirv-tools/source/opt/CMakeFiles/SPIRV-Tools-opt.dir/if_conversion.cpp.o
[252/817] Building CXX object external/spirv-tools/spirv-tools/source/opt/CMakeFiles/SPIRV-Tools-opt.dir/inline_exhaustive_pass.cpp.o
[253/817] Building CXX object external/spirv-tools/spirv-tools/source/opt/CMakeFiles/SPIRV-Tools-opt.dir/inline_opaque_pass.cpp.o
[254/817] Building CXX object external/spirv-tools/spirv-tools/source/opt/CMakeFiles/SPIRV-Tools-opt.dir/inline_pass.cpp.o
[255/817] Building CXX object external/spirv-tools/spirv-tools/source/opt/CMakeFiles/SPIRV-Tools-opt.dir/inst_bindless_check_pass.cpp.o
[256/817] Building CXX object external/spirv-tools/spirv-tools/source/opt/CMakeFiles/SPIRV-Tools-opt.dir/instruction.cpp.o
[257/817] Building CXX object external/spirv-tools/spirv-tools/source/opt/CMakeFiles/SPIRV-Tools-opt.dir/instrument_pass.cpp.o
[258/817] Building CXX object external/spirv-tools/spirv-tools/source/opt/CMakeFiles/SPIRV-Tools-opt.dir/ir_context.cpp.o
[259/817] Building CXX object external/spirv-tools/spirv-tools/source/opt/CMakeFiles/SPIRV-Tools-opt.dir/ir_loader.cpp.o
[260/817] Building CXX object external/spirv-tools/spirv-tools/source/opt/CMakeFiles/SPIRV-Tools-opt.dir/licm_pass.cpp.o
[261/817] Building CXX object external/spirv-tools/spirv-tools/source/opt/CMakeFiles/SPIRV-Tools-opt.dir/local_access_chain_convert_pass.cpp.o
[262/817] Building CXX object external/spirv-tools/spirv-tools/source/opt/CMakeFiles/SPIRV-Tools-opt.dir/local_redundancy_elimination.cpp.o
[263/817] Building CXX object external/spirv-tools/spirv-tools/source/opt/CMakeFiles/SPIRV-Tools-opt.dir/local_single_store_elim_pass.cpp.o
[264/817] Building CXX object external/spirv-tools/spirv-tools/source/opt/CMakeFiles/SPIRV-Tools-opt.dir/loop_fusion.cpp.o
[265/817] Building CXX object external/spirv-tools/spirv-tools/source/opt/CMakeFiles/SPIRV-Tools-opt.dir/local_single_block_elim_pass.cpp.o
[266/817] Building CXX object external/spirv-tools/spirv-tools/source/opt/CMakeFiles/SPIRV-Tools-opt.dir/local_ssa_elim_pass.cpp.o
[267/817] Building CXX object external/spirv-tools/spirv-tools/source/opt/CMakeFiles/SPIRV-Tools-opt.dir/loop_dependence.cpp.o
[268/817] Building CXX object external/spirv-tools/spirv-tools/source/opt/CMakeFiles/SPIRV-Tools-opt.dir/loop_dependence_helpers.cpp.o
[269/817] Building CXX object external/spirv-tools/spirv-tools/source/opt/CMakeFiles/SPIRV-Tools-opt.dir/loop_descriptor.cpp.o
[270/817] Building CXX object external/spirv-tools/spirv-tools/source/opt/CMakeFiles/SPIRV-Tools-opt.dir/loop_fission.cpp.o
[271/817] Building CXX object external/spirv-tools/spirv-tools/source/opt/CMakeFiles/SPIRV-Tools-opt.dir/loop_utils.cpp.o
[272/817] Building CXX object external/spirv-tools/spirv-tools/source/opt/CMakeFiles/SPIRV-Tools-opt.dir/loop_unroller.cpp.o
[273/817] Building CXX object external/spirv-tools/spirv-tools/source/opt/CMakeFiles/SPIRV-Tools-opt.dir/loop_unswitch_pass.cpp.o
[274/817] Building CXX object external/spirv-tools/spirv-tools/source/opt/CMakeFiles/SPIRV-Tools-opt.dir/mem_pass.cpp.o
[275/817] Building CXX object external/spirv-tools/spirv-tools/source/opt/CMakeFiles/SPIRV-Tools-opt.dir/merge_return_pass.cpp.o
[276/817] Building CXX object external/spirv-tools/spirv-tools/source/opt/CMakeFiles/SPIRV-Tools-opt.dir/optimizer.cpp.o
[277/817] Building CXX object external/spirv-tools/spirv-tools/source/opt/CMakeFiles/SPIRV-Tools-opt.dir/pass.cpp.o
[278/817] Building CXX object external/spirv-tools/spirv-tools/source/opt/CMakeFiles/SPIRV-Tools-opt.dir/pass_manager.cpp.o
[279/817] Building CXX object external/spirv-tools/spirv-tools/source/opt/CMakeFiles/SPIRV-Tools-opt.dir/private_to_local_pass.cpp.o
[280/817] Building CXX object external/spirv-tools/spirv-tools/source/opt/CMakeFiles/SPIRV-Tools-opt.dir/process_lines_pass.cpp.o
[281/817] Building CXX object external/spirv-tools/spirv-tools/source/opt/CMakeFiles/SPIRV-Tools-opt.dir/reduce_load_size.cpp.o
[282/817] Building CXX object external/spirv-tools/spirv-tools/source/opt/CMakeFiles/SPIRV-Tools-opt.dir/redundancy_elimination.cpp.o
[283/817] Building CXX object external/spirv-tools/spirv-tools/source/opt/CMakeFiles/SPIRV-Tools-opt.dir/register_pressure.cpp.o
[284/817] Building CXX object external/spirv-tools/spirv-tools/source/opt/CMakeFiles/SPIRV-Tools-opt.dir/propagator.cpp.o
[285/817] Building CXX object external/spirv-tools/spirv-tools/source/opt/CMakeFiles/SPIRV-Tools-opt.dir/remove_duplicates_pass.cpp.o
[286/817] Building CXX object external/spirv-tools/spirv-tools/source/opt/CMakeFiles/SPIRV-Tools-opt.dir/replace_invalid_opc.cpp.o
[287/817] Building CXX object external/spirv-tools/spirv-tools/source/opt/CMakeFiles/SPIRV-Tools-opt.dir/scalar_analysis.cpp.o
[288/817] Building CXX object external/spirv-tools/spirv-tools/source/opt/CMakeFiles/SPIRV-Tools-opt.dir/scalar_analysis_simplification.cpp.o
[289/817] Building CXX object external/spirv-tools/spirv-tools/source/opt/CMakeFiles/SPIRV-Tools-opt.dir/scalar_replacement_pass.cpp.o
[290/817] Building CXX object external/spirv-tools/spirv-tools/source/opt/CMakeFiles/SPIRV-Tools-opt.dir/set_spec_constant_default_value_pass.cpp.o
[291/817] Building CXX object external/spirv-tools/spirv-tools/source/opt/CMakeFiles/SPIRV-Tools-opt.dir/simplification_pass.cpp.o
[292/817] Building CXX object external/spirv-tools/spirv-tools/source/opt/CMakeFiles/SPIRV-Tools-opt.dir/ssa_rewrite_pass.cpp.o
[293/817] Building CXX object external/spirv-tools/spirv-tools/source/opt/CMakeFiles/SPIRV-Tools-opt.dir/strength_reduction_pass.cpp.o
[294/817] Building CXX object external/spirv-tools/spirv-tools/source/opt/CMakeFiles/SPIRV-Tools-opt.dir/strip_debug_info_pass.cpp.o
[295/817] Building CXX object external/spirv-tools/spirv-tools/source/opt/CMakeFiles/SPIRV-Tools-opt.dir/strip_reflect_info_pass.cpp.o
[296/817] Building CXX object external/spirv-tools/spirv-tools/source/opt/CMakeFiles/SPIRV-Tools-opt.dir/struct_cfg_analysis.cpp.o
[297/817] Building CXX object external/spirv-tools/spirv-tools/source/opt/CMakeFiles/SPIRV-Tools-opt.dir/type_manager.cpp.o
[298/817] Building CXX object external/spirv-tools/spirv-tools/source/opt/CMakeFiles/SPIRV-Tools-opt.dir/types.cpp.o
[299/817] Building CXX object external/spirv-tools/spirv-tools/source/opt/CMakeFiles/SPIRV-Tools-opt.dir/unify_const_pass.cpp.o
[300/817] Building CXX object external/spirv-tools/spirv-tools/source/opt/CMakeFiles/SPIRV-Tools-opt.dir/upgrade_memory_model.cpp.o
[301/817] Building CXX object external/spirv-tools/spirv-tools/source/opt/CMakeFiles/SPIRV-Tools-opt.dir/workaround1209.cpp.o
[302/817] Building C object framework/qphelper/CMakeFiles/qphelper.dir/qpCrashHandler.c.o
[303/817] Building C object framework/qphelper/CMakeFiles/qphelper.dir/qpDebugOut.c.o
[304/817] Building C object framework/qphelper/CMakeFiles/qphelper.dir/qpTestLog.c.o
[305/817] Building C object framework/qphelper/CMakeFiles/qphelper.dir/qpWatchDog.c.o
[306/817] Building C object framework/qphelper/CMakeFiles/qphelper.dir/qpXmlWriter.c.o
[307/817] Building CXX object framework/common/CMakeFiles/tcutil.dir/tcuApp.cpp.o
[308/817] Building CXX object framework/common/CMakeFiles/tcutil.dir/tcuArray.cpp.o
[309/817] Building CXX object framework/common/CMakeFiles/tcutil.dir/tcuBilinearImageCompare.cpp.o
[310/817] Building CXX object framework/common/CMakeFiles/tcutil.dir/tcuCommandLine.cpp.o
[311/817] Building CXX object framework/common/CMakeFiles/tcutil.dir/tcuDefs.cpp.o
[312/817] Building CXX object framework/common/CMakeFiles/tcutil.dir/tcuFloat.cpp.o
[313/817] Building CXX object external/spirv-tools/spirv-tools/source/opt/CMakeFiles/SPIRV-Tools-opt.dir/value_number_table.cpp.o
[314/817] Building CXX object external/spirv-tools/spirv-tools/source/opt/CMakeFiles/SPIRV-Tools-opt.dir/vector_dce.cpp.o
[315/817] Linking C static library framework/delibs/depool/libdepool.a
[316/817] Building CXX object framework/common/CMakeFiles/tcutil.dir/tcuCompressedTexture.cpp.o
[317/817] Building CXX object framework/common/CMakeFiles/tcutil.dir/tcuFloatFormat.cpp.o
[318/817] Building CXX object framework/common/CMakeFiles/tcutil.dir/tcuFuzzyImageCompare.cpp.o
[319/817] Building CXX object framework/common/CMakeFiles/tcutil.dir/tcuImageCompare.cpp.o
[320/817] Building CXX object framework/common/CMakeFiles/tcutil.dir/tcuImageIO.cpp.o
[321/817] Building CXX object framework/common/CMakeFiles/tcutil.dir/tcuInterval.cpp.o
[322/817] Building CXX object framework/common/CMakeFiles/tcutil.dir/tcuMatrix.cpp.o
[323/817] Building CXX object framework/common/CMakeFiles/tcutil.dir/tcuPlatform.cpp.o
[324/817] Building CXX object framework/common/CMakeFiles/tcutil.dir/tcuRGBA.cpp.o
[325/817] Building CXX object framework/common/CMakeFiles/tcutil.dir/tcuRandomValueIterator.cpp.o
[326/817] Building CXX object framework/common/CMakeFiles/tcutil.dir/tcuRenderTarget.cpp.o
[327/817] Building CXX object framework/common/CMakeFiles/tcutil.dir/tcuResource.cpp.o
[328/817] Building CXX object framework/common/CMakeFiles/tcutil.dir/tcuResultCollector.cpp.o
[329/817] Building CXX object framework/common/CMakeFiles/tcutil.dir/tcuSurface.cpp.o
[330/817] Building CXX object framework/common/CMakeFiles/tcutil.dir/tcuSurfaceAccess.cpp.o
[331/817] Building CXX object framework/common/CMakeFiles/tcutil.dir/tcuTestCase.cpp.o
[332/817] Building CXX object framework/common/CMakeFiles/tcutil.dir/tcuTestContext.cpp.o
[333/817] Building CXX object framework/common/CMakeFiles/tcutil.dir/tcuTestSessionExecutor.cpp.o
[334/817] Building CXX object framework/common/CMakeFiles/tcutil.dir/tcuTestLog.cpp.o
[335/817] Building CXX object framework/common/CMakeFiles/tcutil.dir/tcuTestPackage.cpp.o
[336/817] Building CXX object framework/common/CMakeFiles/tcutil.dir/tcuTexture.cpp.o
[337/817] Building CXX object framework/common/CMakeFiles/tcutil.dir/tcuFunctionLibrary.cpp.o
[338/817] Building CXX object framework/common/CMakeFiles/tcutil.dir/tcuThreadUtil.cpp.o
[339/817] Building CXX object framework/common/CMakeFiles/tcutil.dir/tcuStringTemplate.cpp.o
[340/817] Building CXX object framework/common/CMakeFiles/tcutil.dir/tcuTexVerifierUtil.cpp.o
[341/817] Building CXX object framework/common/CMakeFiles/tcutil.dir/tcuFactoryRegistry.cpp.o
[342/817] Building CXX object external/glslang/src/glslang/CMakeFiles/glslang.dir/MachineIndependent/Scan.cpp.o
[343/817] Building CXX object framework/common/CMakeFiles/tcutil.dir/tcuTextureUtil.cpp.o
[344/817] Building CXX object framework/common/CMakeFiles/tcutil.dir/tcuTexLookupVerifier.cpp.o
[345/817] Building CXX object framework/common/CMakeFiles/tcutil.dir/tcuTexCompareVerifier.cpp.o
[346/817] Building CXX object framework/common/CMakeFiles/tcutil.dir/tcuCPUWarmup.cpp.o
[347/817] Building CXX object framework/common/CMakeFiles/tcutil.dir/tcuSeedBuilder.cpp.o
[348/817] Building CXX object framework/common/CMakeFiles/tcutil.dir/tcuMaybe.cpp.o
[349/817] Building CXX object framework/common/CMakeFiles/tcutil.dir/tcuEither.cpp.o
[350/817] Building CXX object framework/common/CMakeFiles/tcutil.dir/tcuTestHierarchyIterator.cpp.o
[351/817] Building CXX object framework/common/CMakeFiles/tcutil.dir/tcuTestHierarchyUtil.cpp.o
[352/817] Building CXX object framework/common/CMakeFiles/tcutil.dir/tcuAstcUtil.cpp.o
[353/817] Building CXX object framework/common/CMakeFiles/tcutil.dir/tcuRasterizationVerifier.cpp.o
[354/817] Building CXX object framework/opengl/CMakeFiles/glutil.dir/gluContextInfo.cpp.o
[355/817] Building CXX object framework/opengl/CMakeFiles/glutil.dir/gluDefs.cpp.o
[356/817] Building CXX object framework/opengl/CMakeFiles/glutil.dir/gluDrawUtil.cpp.o
[357/817] Building CXX object framework/opengl/CMakeFiles/glutil.dir/gluFboRenderContext.cpp.o
[358/817] Building CXX object framework/opengl/CMakeFiles/glutil.dir/gluPixelTransfer.cpp.o
[359/817] Building CXX object framework/opengl/CMakeFiles/glutil.dir/gluProgramInterfaceQuery.cpp.o
[360/817] Building CXX object framework/opengl/CMakeFiles/glutil.dir/gluRenderConfig.cpp.o
[361/817] Building CXX object framework/opengl/CMakeFiles/glutil.dir/gluRenderContext.cpp.o
[362/817] Building CXX object framework/opengl/CMakeFiles/glutil.dir/gluShaderProgram.cpp.o
[363/817] Building CXX object framework/opengl/CMakeFiles/glutil.dir/gluShaderUtil.cpp.o
[364/817] Building CXX object framework/opengl/CMakeFiles/glutil.dir/gluStateReset.cpp.o
[365/817] Building CXX object framework/opengl/CMakeFiles/glutil.dir/gluTexture.cpp.o
[366/817] Building CXX object framework/opengl/CMakeFiles/glutil.dir/gluContextFactory.cpp.o
[367/817] Building CXX object framework/referencerenderer/CMakeFiles/referencerenderer.dir/rrDefs.cpp.o
[368/817] Building CXX object external/spirv-tools/spirv-tools/source/CMakeFiles/SPIRV-Tools.dir/extensions.cpp.o
[369/817] Linking C static library framework/delibs/dethread/libdethread.a
[370/817] Building CXX object framework/opengl/CMakeFiles/glutil.dir/gluTextureUtil.cpp.o
[371/817] Building CXX object framework/opengl/CMakeFiles/glutil.dir/gluTextureTestUtil.cpp.o
[372/817] Building CXX object framework/opengl/CMakeFiles/glutil.dir/gluVarType.cpp.o
[373/817] Building CXX object framework/opengl/CMakeFiles/glutil.dir/gluVarTypeUtil.cpp.o
[374/817] Building CXX object framework/opengl/CMakeFiles/glutil.dir/gluStrUtil.cpp.o
[375/817] Building CXX object framework/opengl/CMakeFiles/glutil.dir/gluCallLogWrapper.cpp.o
[376/817] Building CXX object framework/opengl/CMakeFiles/glutil.dir/gluObjectWrapper.cpp.o
[377/817] Building CXX object framework/opengl/CMakeFiles/glutil.dir/gluDummyRenderContext.cpp.o
[378/817] Building CXX object framework/opengl/CMakeFiles/glutil.dir/gluPlatform.cpp.o
[379/817] Building CXX object framework/opengl/CMakeFiles/glutil.dir/gluShaderLibrary.cpp.o
[380/817] Building CXX object framework/referencerenderer/CMakeFiles/referencerenderer.dir/rrFragmentOperations.cpp.o
[381/817] Building CXX object framework/referencerenderer/CMakeFiles/referencerenderer.dir/rrMultisamplePixelBufferAccess.cpp.o
[382/817] Building CXX object framework/referencerenderer/CMakeFiles/referencerenderer.dir/rrPrimitivePacket.cpp.o
[383/817] Building CXX object framework/referencerenderer/CMakeFiles/referencerenderer.dir/rrRasterizer.cpp.o
[384/817] Building CXX object framework/referencerenderer/CMakeFiles/referencerenderer.dir/rrRenderer.cpp.o
[385/817] Building CXX object framework/referencerenderer/CMakeFiles/referencerenderer.dir/rrShaders.cpp.o
[386/817] Building CXX object framework/referencerenderer/CMakeFiles/referencerenderer.dir/rrShadingContext.cpp.o
[387/817] Building CXX object framework/referencerenderer/CMakeFiles/referencerenderer.dir/rrVertexAttrib.cpp.o
[388/817] Building CXX object framework/referencerenderer/CMakeFiles/referencerenderer.dir/rrVertexPacket.cpp.o
[389/817] Building CXX object external/vulkancts/framework/vulkan/CMakeFiles/vkutil.dir/vkSpirVProgram.cpp.o
[390/817] Building CXX object external/vulkancts/framework/vulkan/CMakeFiles/vkutilnoshader.dir/vkApiVersion.cpp.o
[391/817] Building CXX object external/vulkancts/framework/vulkan/CMakeFiles/vkutilnoshader.dir/vkBarrierUtil.cpp.o
[392/817] Building CXX object external/vulkancts/framework/vulkan/CMakeFiles/vkutilnoshader.dir/vkCmdUtil.cpp.o
[393/817] Building CXX object external/spirv-tools/spirv-tools/source/CMakeFiles/SPIRV-Tools.dir/assembly_grammar.cpp.o
[394/817] Building CXX object external/spirv-tools/spirv-tools/source/CMakeFiles/SPIRV-Tools.dir/diagnostic.cpp.o
[395/817] Building CXX object external/spirv-tools/spirv-tools/source/CMakeFiles/SPIRV-Tools.dir/ext_inst.cpp.o
[396/817] Building CXX object external/spirv-tools/spirv-tools/source/CMakeFiles/SPIRV-Tools.dir/table.cpp.o
[397/817] Building C object framework/qphelper/CMakeFiles/qphelper.dir/qpInfo.c.o
[398/817] Building CXX object external/vulkancts/framework/vulkan/CMakeFiles/vkutil.dir/vkPrograms.cpp.o
[399/817] Building CXX object external/vulkancts/framework/vulkan/CMakeFiles/vkutil.dir/vkShaderToSpirV.cpp.o
[400/817] Building CXX object external/vulkancts/framework/vulkan/CMakeFiles/vkutil.dir/vkSpirVAsm.cpp.o
[401/817] Building CXX object external/vulkancts/framework/vulkan/CMakeFiles/vkutilnoshader.dir/vkBuilderUtil.cpp.o
[402/817] Building CXX object external/vulkancts/framework/vulkan/CMakeFiles/vkutilnoshader.dir/vkDefs.cpp.o
[403/817] Building CXX object external/vulkancts/framework/vulkan/CMakeFiles/vkutilnoshader.dir/vkRef.cpp.o
[404/817] Building CXX object external/vulkancts/framework/vulkan/CMakeFiles/vkutilnoshader.dir/vkRefUtil.cpp.o
[405/817] Building CXX object external/vulkancts/framework/vulkan/CMakeFiles/vkutilnoshader.dir/vkPlatform.cpp.o
[406/817] Building CXX object external/vulkancts/framework/vulkan/CMakeFiles/vkutilnoshader.dir/vkStrUtil.cpp.o
[407/817] Building CXX object external/vulkancts/framework/vulkan/CMakeFiles/vkutilnoshader.dir/vkQueryUtil.cpp.o
[408/817] Building CXX object external/vulkancts/framework/vulkan/CMakeFiles/vkutilnoshader.dir/vkMemUtil.cpp.o
[409/817] Building CXX object external/vulkancts/framework/vulkan/CMakeFiles/vkutilnoshader.dir/vkDeviceUtil.cpp.o
[410/817] Building CXX object external/vulkancts/framework/vulkan/CMakeFiles/vkutilnoshader.dir/vkBinaryRegistry.cpp.o
[411/817] Building CXX object external/vulkancts/framework/vulkan/CMakeFiles/vkutilnoshader.dir/vkNullDriver.cpp.o
[412/817] Building CXX object external/vulkancts/framework/vulkan/CMakeFiles/vkutilnoshader.dir/vkImageUtil.cpp.o
[413/817] Building CXX object external/vulkancts/framework/vulkan/CMakeFiles/vkutilnoshader.dir/vkTypeUtil.cpp.o
[414/817] Building CXX object external/vulkancts/framework/vulkan/CMakeFiles/vkutilnoshader.dir/vkAllocationCallbackUtil.cpp.o
[415/817] Building CXX object external/vulkancts/framework/vulkan/CMakeFiles/vkutilnoshader.dir/vkWsiPlatform.cpp.o
[416/817] Building CXX object external/vulkancts/framework/vulkan/CMakeFiles/vkutilnoshader.dir/vkWsiUtil.cpp.o
[417/817] Building CXX object external/vulkancts/framework/vulkan/CMakeFiles/vkutilnoshader.dir/vkDebugReportUtil.cpp.o
[418/817] Building CXX object external/vulkancts/framework/vulkan/CMakeFiles/vkutilnoshader.dir/vkBufferWithMemory.cpp.o
[419/817] Building CXX object external/vulkancts/framework/vulkan/CMakeFiles/vkutilnoshader.dir/vkImageWithMemory.cpp.o
[420/817] Building CXX object external/vulkancts/framework/vulkan/CMakeFiles/vkutilnoshader.dir/vkObjUtil.cpp.o
[421/817] Building CXX object external/glslang/src/glslang/CMakeFiles/glslang.dir/MachineIndependent/glslang_tab.cpp.o
[422/817] Building CXX object external/spirv-tools/spirv-tools/source/CMakeFiles/SPIRV-Tools.dir/enum_string_mapping.cpp.o
[423/817] Building CXX object external/spirv-tools/spirv-tools/source/CMakeFiles/SPIRV-Tools.dir/libspirv.cpp.o
[424/817] Building CXX object external/spirv-tools/spirv-tools/source/CMakeFiles/SPIRV-Tools.dir/val/validate_annotation.cpp.o
[425/817] Building CXX object external/vulkancts/framework/vulkan/CMakeFiles/vkutilnoshader.dir/vkShaderProgram.cpp.o
[426/817] Building CXX object external/vulkancts/framework/vulkan/CMakeFiles/vkutilnoshader.dir/vkYCbCrImageWithMemory.cpp.o
[427/817] Linking C static library framework/delibs/deutil/libdeutil.a
[428/817] Building CXX object external/vulkancts/modules/vulkan/api/CMakeFiles/deqp-vk-api.dir/vktApiBufferViewAccessTests.cpp.o
[429/817] Building CXX object external/vulkancts/modules/vulkan/api/CMakeFiles/deqp-vk-api.dir/vktApiBufferViewCreateTests.cpp.o
[430/817] Building CXX object external/vulkancts/modules/vulkan/api/CMakeFiles/deqp-vk-api.dir/vktApiVersionCheck.cpp.o
[431/817] Building CXX object external/vulkancts/modules/vulkan/api/CMakeFiles/deqp-vk-api.dir/vktApiTests.cpp.o
[432/817] Building CXX object external/vulkancts/modules/vulkan/api/CMakeFiles/deqp-vk-api.dir/vktApiSmokeTests.cpp.o
[433/817] Building CXX object external/vulkancts/modules/vulkan/api/CMakeFiles/deqp-vk-api.dir/vktApiDeviceInitializationTests.cpp.o
[434/817] Building CXX object external/vulkancts/modules/vulkan/api/CMakeFiles/deqp-vk-api.dir/vktApiDriverPropertiesTests.cpp.o
[435/817] Building CXX object external/vulkancts/modules/vulkan/api/CMakeFiles/deqp-vk-api.dir/vktApiObjectManagementTests.cpp.o
[436/817] Building CXX object external/vulkancts/modules/vulkan/api/CMakeFiles/deqp-vk-api.dir/vktApiBufferTests.cpp.o
[437/817] Building CXX object external/vulkancts/modules/vulkan/api/CMakeFiles/deqp-vk-api.dir/vktApiCommandBuffersTests.cpp.o
[438/817] Building CXX object external/vulkancts/modules/vulkan/api/CMakeFiles/deqp-vk-api.dir/vktApiComputeInstanceResultBuffer.cpp.o
[439/817] Building CXX object external/vulkancts/modules/vulkan/api/CMakeFiles/deqp-vk-api.dir/vktApiBufferComputeInstance.cpp.o
[440/817] Building CXX object external/vulkancts/modules/vulkan/api/CMakeFiles/deqp-vk-api.dir/vktApiImageClearingTests.cpp.o
[441/817] Building CXX object external/vulkancts/modules/vulkan/api/CMakeFiles/deqp-vk-api.dir/vktApiFillBufferTests.cpp.o
[442/817] Building CXX object external/spirv-tools/spirv-tools/source/CMakeFiles/SPIRV-Tools.dir/id_descriptor.cpp.o
[443/817] Building CXX object external/spirv-tools/spirv-tools/source/CMakeFiles/SPIRV-Tools.dir/name_mapper.cpp.o
[444/817] Building CXX object external/spirv-tools/spirv-tools/source/CMakeFiles/SPIRV-Tools.dir/opcode.cpp.o
[445/817] Building CXX object external/spirv-tools/spirv-tools/source/CMakeFiles/SPIRV-Tools.dir/val/validate.cpp.o
[446/817] Building CXX object external/spirv-tools/spirv-tools/source/CMakeFiles/SPIRV-Tools.dir/val/validate_adjacency.cpp.o
[447/817] Building CXX object external/spirv-tools/spirv-tools/source/CMakeFiles/SPIRV-Tools.dir/val/validate_arithmetics.cpp.o
[448/817] Building CXX object external/vulkancts/modules/vulkan/api/CMakeFiles/deqp-vk-api.dir/vktApiFeatureInfo.cpp.o
[449/817] Building CXX object external/vulkancts/modules/vulkan/api/CMakeFiles/deqp-vk-api.dir/vktApiCopiesAndBlittingTests.cpp.o
[450/817] Building CXX object external/vulkancts/modules/vulkan/api/CMakeFiles/deqp-vk-api.dir/vktApiDescriptorPoolTests.cpp.o
[451/817] Building CXX object external/vulkancts/modules/vulkan/api/CMakeFiles/deqp-vk-api.dir/vktApiNullHandleTests.cpp.o
[452/817] Building CXX object external/spirv-tools/spirv-tools/source/CMakeFiles/SPIRV-Tools.dir/operand.cpp.o
[453/817] Building CXX object external/spirv-tools/spirv-tools/source/CMakeFiles/SPIRV-Tools.dir/val/validate_atomics.cpp.o
[454/817] Building CXX object external/spirv-tools/spirv-tools/source/CMakeFiles/SPIRV-Tools.dir/val/validate_barriers.cpp.o
[455/817] Linking C static library framework/qphelper/libqphelper.a
[456/817] Building CXX object external/spirv-tools/spirv-tools/source/CMakeFiles/SPIRV-Tools.dir/text_handler.cpp.o
[457/817] Building CXX object external/spirv-tools/spirv-tools/source/CMakeFiles/SPIRV-Tools.dir/binary.cpp.o
[458/817] Building CXX object external/spirv-tools/spirv-tools/source/opt/CMakeFiles/SPIRV-Tools-opt.dir/loop_peeling.cpp.o
[459/817] Linking CXX static library framework/delibs/decpp/libdecpp.a
[460/817] Building CXX object external/spirv-tools/spirv-tools/source/CMakeFiles/SPIRV-Tools.dir/disassemble.cpp.o
[461/817] Linking CXX static library external/glslang/src/glslang/libglslang.a
[462/817] Building CXX object external/spirv-tools/spirv-tools/source/opt/CMakeFiles/SPIRV-Tools-opt.dir/module.cpp.o
[463/817] Linking CXX static library framework/opengl/wrapper/libglwrapper.a
[464/817] Building CXX object external/spirv-tools/spirv-tools/source/opt/CMakeFiles/SPIRV-Tools-opt.dir/loop_fusion_pass.cpp.o
[465/817] Linking CXX static library framework/common/libtcutil.a
[466/817] Building CXX object external/spirv-tools/spirv-tools/source/CMakeFiles/SPIRV-Tools.dir/text.cpp.o
[467/817] Linking CXX static library external/glslang/src/SPIRV/libSPIRV.a
[468/817] Linking CXX static library framework/opengl/libglutil.a
[469/817] Linking CXX static library external/spirv-tools/spirv-tools/source/libSPIRV-Tools.a
[470/817] Linking CXX static library framework/referencerenderer/libreferencerenderer.a
[471/817] Linking CXX static library external/spirv-tools/spirv-tools/source/opt/libSPIRV-Tools-opt.a
[472/817] Building CXX object external/vulkancts/framework/vulkan/CMakeFiles/vkutilnoshader.dir/vkRenderDocUtil.cpp.o
FAILED: external/vulkancts/framework/vulkan/CMakeFiles/vkutilnoshader.dir/vkRenderDocUtil.cpp.o 
ccache /usr/bin/clang++  -DDEQP_EGL_DIRECT_LINK=1 -DDEQP_HAVE_GLSLANG=1 -DDEQP_HAVE_SPIRV_TOOLS=1 -DDEQP_TARGET_NAME=\"Default\" -DDE_ASSERT_FAILURE_CALLBACK -DDE_COMPILER=DE_COMPILER_CLANG -DDE_CPU=DE_CPU_X86_64 -DDE_OS=DE_OS_UNIX -DDE_PTR_SIZE=8 -I../framework/delibs/debase -I../framework/delibs/decpp -I../framework/delibs/depool -I../framework/delibs/dethread -I../framework/delibs/deutil -I../framework/delibs/destream -I../external/vkrunner/src -I../external/spirv-headers/src/include -I../external/renderdoc/src -I../framework/common -I../framework/qphelper -I../framework/opengl -I../framework/opengl/wrapper -I../framework/referencerenderer -I../framework/opengl/simplereference -I../framework/randomshaders -I../framework/egl -I../framework/egl/wrapper -I../external/vulkancts/framework/vulkan -I../external/glslang/src -I../external/spirv-tools/src/include -I../external/spirv-tools/src/external/include -Wall -Wextra -Wno-long-long -Wshadow -Wundef -Wconversion -Wno-sign-conversion -m64 -std=c++03 -Wno-delete-non-virtual-dtor -fwrapv -fvisibility=hidden -fvisibility-inlines-hidden -O3 -DNDEBUG -MD -MT external/vulkancts/framework/vulkan/CMakeFiles/vkutilnoshader.dir/vkRenderDocUtil.cpp.o -MF external/vulkancts/framework/vulkan/CMakeFiles/vkutilnoshader.dir/vkRenderDocUtil.cpp.o.d -o external/vulkancts/framework/vulkan/CMakeFiles/vkutilnoshader.dir/vkRenderDocUtil.cpp.o -c ../external/vulkancts/framework/vulkan/vkRenderDocUtil.cpp
../external/vulkancts/framework/vulkan/vkRenderDocUtil.cpp:31:10: fatal error: 'renderdoc_app.h' file not found
#include "renderdoc_app.h"
         ^~~~~~~~~~~~~~~~~
1 error generated.
[473/817] Building CXX object external/vulkancts/modules/vulkan/CMakeFiles/deqp-vk-package.dir/vktTestGroupUtil.cpp.o
[474/817] Building CXX object external/vulkancts/modules/vulkan/binding_model/CMakeFiles/deqp-vk-binding-model.dir/vktBindingModelTests.cpp.o
[475/817] Building CXX object external/vulkancts/modules/vulkan/spirv_assembly/CMakeFiles/deqp-vk-spirv-assembly.dir/vktSpvAsmTests.cpp.o
[476/817] Building CXX object external/vulkancts/modules/vulkan/pipeline/CMakeFiles/deqp-vk-pipeline.dir/vktPipelineClearUtil.cpp.o
[477/817] Building CXX object external/vulkancts/modules/vulkan/CMakeFiles/deqp-vk-package.dir/vktTestCaseUtil.cpp.o
[478/817] Building CXX object external/vulkancts/modules/vulkan/pipeline/CMakeFiles/deqp-vk-pipeline.dir/vktPipelineTests.cpp.o
[479/817] Building CXX object external/vulkancts/modules/vulkan/pipeline/CMakeFiles/deqp-vk-pipeline.dir/vktPipelineReferenceRenderer.cpp.o
[480/817] Building CXX object external/vulkancts/modules/vulkan/pipeline/CMakeFiles/deqp-vk-pipeline.dir/vktPipelineSpecConstantUtil.cpp.o
[481/817] Building CXX object external/vulkancts/modules/vulkan/pipeline/CMakeFiles/deqp-vk-pipeline.dir/vktPipelineMakeUtil.cpp.o
[482/817] Building CXX object external/vulkancts/modules/vulkan/api/CMakeFiles/deqp-vk-api.dir/vktApiBufferAndImageAllocationUtil.cpp.o
[483/817] Building CXX object external/vulkancts/modules/vulkan/binding_model/CMakeFiles/deqp-vk-binding-model.dir/vktBindingDescriptorUpdateTests.cpp.o
[484/817] Building CXX object external/vulkancts/modules/vulkan/pipeline/CMakeFiles/deqp-vk-pipeline.dir/vktPipelineMultisampleBase.cpp.o
[485/817] Building CXX object external/vulkancts/modules/vulkan/api/CMakeFiles/deqp-vk-api.dir/vktApiMaintenance3Check.cpp.o
[486/817] Building CXX object external/vulkancts/modules/vulkan/pipeline/CMakeFiles/deqp-vk-pipeline.dir/vktPipelineMultisampleTestsUtil.cpp.o
[487/817] Building CXX object external/vulkancts/modules/vulkan/pipeline/CMakeFiles/deqp-vk-pipeline.dir/vktPipelineVertexUtil.cpp.o
[488/817] Building CXX object external/vulkancts/modules/vulkan/pipeline/CMakeFiles/deqp-vk-pipeline.dir/vktPipelineEarlyDestroyTests.cpp.o
[489/817] Building CXX object external/vulkancts/modules/vulkan/spirv_assembly/CMakeFiles/deqp-vk-spirv-assembly.dir/vktSpvAsmComputeShaderTestUtil.cpp.o
[490/817] Building CXX object external/vulkancts/modules/vulkan/CMakeFiles/deqp-vk-package.dir/vktInfoTests.cpp.o
[491/817] Building CXX object external/vulkancts/modules/vulkan/pipeline/CMakeFiles/deqp-vk-pipeline.dir/vktPipelineMatchedAttachmentsTests.cpp.o
[492/817] Building CXX object external/vulkancts/modules/vulkan/api/CMakeFiles/deqp-vk-api.dir/vktApiDescriptorSetTests.cpp.o
[493/817] Building CXX object external/vulkancts/modules/vulkan/api/CMakeFiles/deqp-vk-api.dir/vktApiMemoryRequirementInvarianceTests.cpp.o
[494/817] Building CXX object external/vulkancts/modules/vulkan/pipeline/CMakeFiles/deqp-vk-pipeline.dir/vktPipelineDerivativeTests.cpp.o
[495/817] Building CXX object external/vulkancts/modules/vulkan/pipeline/CMakeFiles/deqp-vk-pipeline.dir/vktPipelineStencilExportTests.cpp.o
[496/817] Building CXX object external/vulkancts/modules/vulkan/pipeline/CMakeFiles/deqp-vk-pipeline.dir/vktPipelineMultisampleBaseResolve.cpp.o
[497/817] Building CXX object external/vulkancts/modules/vulkan/api/CMakeFiles/deqp-vk-api.dir/vktApiGetMemoryCommitment.cpp.o
[498/817] Building CXX object external/vulkancts/modules/vulkan/spirv_assembly/CMakeFiles/deqp-vk-spirv-assembly.dir/vktSpvAsmConditionalBranchTests.cpp.o
[499/817] Building CXX object external/vulkancts/modules/vulkan/CMakeFiles/deqp-vk-package.dir/vktTestCase.cpp.o
[500/817] Building CXX object external/vulkancts/modules/vulkan/pipeline/CMakeFiles/deqp-vk-pipeline.dir/vktPipelineImageUtil.cpp.o
[501/817] Building CXX object external/vulkancts/modules/vulkan/api/CMakeFiles/deqp-vk-api.dir/vktApiGranularityTests.cpp.o
[502/817] Building CXX object external/vulkancts/modules/vulkan/spirv_assembly/CMakeFiles/deqp-vk-spirv-assembly.dir/vktSpvAsmPointerParameterTests.cpp.o
[503/817] Building CXX object external/vulkancts/modules/vulkan/CMakeFiles/deqp-vk-package.dir/vktTestPackage.cpp.o
[504/817] Building CXX object external/vulkancts/modules/vulkan/pipeline/CMakeFiles/deqp-vk-pipeline.dir/vktPipelineMultisampleShaderBuiltInTests.cpp.o
[505/817] Building CXX object external/vulkancts/modules/vulkan/api/CMakeFiles/deqp-vk-api.dir/vktApiPipelineTests.cpp.o
[506/817] Building CXX object external/vulkancts/modules/vulkan/spirv_assembly/CMakeFiles/deqp-vk-spirv-assembly.dir/vktSpvAsmUboMatrixPaddingTests.cpp.o
[507/817] Building CXX object external/vulkancts/modules/vulkan/pipeline/CMakeFiles/deqp-vk-pipeline.dir/vktPipelineImageTests.cpp.o
[508/817] Building CXX object external/vulkancts/modules/vulkan/pipeline/CMakeFiles/deqp-vk-pipeline.dir/vktPipelineMultisampleInterpolationTests.cpp.o
[509/817] Building CXX object external/vulkancts/modules/vulkan/pipeline/CMakeFiles/deqp-vk-pipeline.dir/vktPipelineSamplerTests.cpp.o
[510/817] Building CXX object external/vulkancts/modules/vulkan/pipeline/CMakeFiles/deqp-vk-pipeline.dir/vktPipelineImageViewTests.cpp.o
[511/817] Building CXX object external/vulkancts/modules/vulkan/pipeline/CMakeFiles/deqp-vk-pipeline.dir/vktPipelineMultisampleBaseResolveAndPerSampleFetch.cpp.o
[512/817] Building CXX object external/vulkancts/modules/vulkan/spirv_assembly/CMakeFiles/deqp-vk-spirv-assembly.dir/vktSpvAsmUtils.cpp.o
[513/817] Building CXX object external/vulkancts/modules/vulkan/pipeline/CMakeFiles/deqp-vk-pipeline.dir/vktPipelineStencilTests.cpp.o
[514/817] Building CXX object external/vulkancts/modules/vulkan/pipeline/CMakeFiles/deqp-vk-pipeline.dir/vktPipelineBlendTests.cpp.o
[515/817] Building CXX object external/vulkancts/modules/vulkan/CMakeFiles/vk-build-programs.dir/vktBuildPrograms.cpp.o
[516/817] Building CXX object external/vulkancts/modules/vulkan/pipeline/CMakeFiles/deqp-vk-pipeline.dir/vktPipelineCacheTests.cpp.o
[517/817] Building CXX object external/vulkancts/modules/vulkan/spirv_assembly/CMakeFiles/deqp-vk-spirv-assembly.dir/vktSpvAsmCrossStageInterfaceTests.cpp.o
[518/817] Building CXX object external/vulkancts/modules/vulkan/pipeline/CMakeFiles/deqp-vk-pipeline.dir/vktPipelineDepthTests.cpp.o
[519/817] Building CXX object external/vulkancts/modules/vulkan/spirv_assembly/CMakeFiles/deqp-vk-spirv-assembly.dir/vktSpvAsmComputeShaderCase.cpp.o
[520/817] Building CXX object external/vulkancts/modules/vulkan/binding_model/CMakeFiles/deqp-vk-binding-model.dir/vktBindingDescriptorSetRandomTests.cpp.o
[521/817] Building CXX object external/vulkancts/modules/vulkan/pipeline/CMakeFiles/deqp-vk-pipeline.dir/vktPipelineInputAssemblyTests.cpp.o
[522/817] Building CXX object external/vulkancts/modules/vulkan/spirv_assembly/CMakeFiles/deqp-vk-spirv-assembly.dir/vktSpvAsmCompositeInsertTests.cpp.o
[523/817] Building CXX object external/vulkancts/modules/vulkan/spirv_assembly/CMakeFiles/deqp-vk-spirv-assembly.dir/vktSpvAsmImageSamplerTests.cpp.o
[524/817] Building CXX object external/vulkancts/modules/vulkan/pipeline/CMakeFiles/deqp-vk-pipeline.dir/vktPipelineTimestampTests.cpp.o
[525/817] Building CXX object external/vulkancts/modules/vulkan/pipeline/CMakeFiles/deqp-vk-pipeline.dir/vktPipelineMultisampleImageTests.cpp.o
[526/817] Building CXX object external/vulkancts/modules/vulkan/pipeline/CMakeFiles/deqp-vk-pipeline.dir/vktPipelineVertexInputTests.cpp.o
[527/817] Building CXX object external/vulkancts/modules/vulkan/spirv_assembly/CMakeFiles/deqp-vk-spirv-assembly.dir/vktSpvAsmIndexingTests.cpp.o
[528/817] Building CXX object external/vulkancts/modules/vulkan/CMakeFiles/deqp-vk-package.dir/vktShaderLibrary.cpp.o
[529/817] Building CXX object external/vulkancts/modules/vulkan/pipeline/CMakeFiles/deqp-vk-pipeline.dir/vktPipelineFramebufferAttachmentTests.cpp.o
[530/817] Building CXX object external/vulkancts/modules/vulkan/pipeline/CMakeFiles/deqp-vk-pipeline.dir/vktPipelineDynamicOffsetTests.cpp.o
[531/817] Building CXX object external/vulkancts/modules/vulkan/pipeline/CMakeFiles/deqp-vk-pipeline.dir/vktPipelinePushConstantTests.cpp.o
[532/817] Building CXX object external/vulkancts/modules/vulkan/pipeline/CMakeFiles/deqp-vk-pipeline.dir/vktPipelineRenderToImageTests.cpp.o
[533/817] Building CXX object external/vulkancts/modules/vulkan/pipeline/CMakeFiles/deqp-vk-pipeline.dir/vktPipelineImageSamplingInstance.cpp.o
[534/817] Building CXX object external/vulkancts/modules/vulkan/pipeline/CMakeFiles/deqp-vk-pipeline.dir/vktPipelineMultisampleTests.cpp.o
[535/817] Building CXX object external/vulkancts/modules/vulkan/api/CMakeFiles/deqp-vk-api.dir/vktApiExternalMemoryTests.cpp.o
[536/817] Building CXX object external/vulkancts/modules/vulkan/pipeline/CMakeFiles/deqp-vk-pipeline.dir/vktPipelineSpecConstantTests.cpp.o
[537/817] Building CXX object external/vulkancts/modules/vulkan/spirv_assembly/CMakeFiles/deqp-vk-spirv-assembly.dir/vktSpvAsmFloatControlsTests.cpp.o
[538/817] Building CXX object external/vulkancts/modules/vulkan/pipeline/CMakeFiles/deqp-vk-pipeline.dir/vktPipelinePushDescriptorTests.cpp.o
[539/817] Building CXX object external/vulkancts/modules/vulkan/pipeline/CMakeFiles/deqp-vk-pipeline.dir/vktPipelineMultisampleSampleLocationsExtTests.cpp.o
[540/817] Building CXX object external/vulkancts/modules/vulkan/spirv_assembly/CMakeFiles/deqp-vk-spirv-assembly.dir/vktSpvAsmGraphicsShaderTestUtil.cpp.o
[541/817] Building CXX object external/vulkancts/modules/vulkan/spirv_assembly/CMakeFiles/deqp-vk-spirv-assembly.dir/vktSpvAsm8bitStorageTests.cpp.o
[542/817] Building CXX object external/vulkancts/modules/vulkan/binding_model/CMakeFiles/deqp-vk-binding-model.dir/vktBindingShaderAccessTests.cpp.o
[543/817] Building CXX object external/vulkancts/modules/vulkan/spirv_assembly/CMakeFiles/deqp-vk-spirv-assembly.dir/vktSpvAsm16bitStorageTests.cpp.o
[544/817] Building CXX object external/vulkancts/modules/vulkan/spirv_assembly/CMakeFiles/deqp-vk-spirv-assembly.dir/vktSpvAsmTypeTests.cpp.o
[545/817] Building CXX object external/vulkancts/modules/vulkan/spirv_assembly/CMakeFiles/deqp-vk-spirv-assembly.dir/vktSpvAsmInstructionTests.cpp.o
ninja: build stopped: subcommand failed.
ERROR: command failed
Traceback (most recent call last):
  File "vulkancts/build.py", line 93, in <module>
    bs.build(VulkanCtsBuilder())
  File "/home/jenkins/workspace/Leeroy/vulkancts/../repos/mesa_ci/build_support/__init__.py", line 165, in build
    a()
  File "vulkancts/build.py", line 65, in build
    bs.run_batch_command(["ninja", "vk-build-programs"])
  File "/home/jenkins/workspace/Leeroy/vulkancts/../repos/mesa_ci/build_support/command.py", line 132, in run_batch_command
    raise subprocess.CalledProcessError(p.returncode,commands) 
subprocess.CalledProcessError: Command '['ninja', 'vk-build-programs']' returned non-zero exit status 1
Build step 'Execute shell' marked build as failure
Set build name.
New build name is 'vulkancts-apinheiro-m64-builder'
Variable with name 'BUILD_DISPLAY_NAME' already exists, current value: 'vulkancts-apinheiro-m64-builder', new value: 'vulkancts-apinheiro-m64-builder'
[WARNINGS] Skipping publisher since build result is FAILURE
Performing Post build task...
Match found for :python : True
Logical operation result is TRUE
Running script  : rm -rf /tmp/jenkins/${BUILD_NUMBER}
[Leeroy] $ /bin/sh -xe /tmp/hudson6042844952856955959.sh
+ rm -rf /tmp/jenkins/2987384
POST BUILD TASK : SUCCESS
END OF POST BUILD TASK : 0
[xUnit] [INFO] - Starting to record.
[xUnit] [INFO] - Processing JUnit
[xUnit] [INFO] - [JUnit] - No test report file(s) were found with the pattern 'test/piglit*xml' relative to '/home/jenkins/workspace/Leeroy' for the testing framework 'JUnit'.  Did you enter a pattern relative to the correct directory?  Did you generate the result report(s) for 'JUnit'?
[xUnit] [WARNING] - No test reports found for the metric 'JUnit' with the resolved pattern 'test/piglit*xml'.
[xUnit] [INFO] - Skipping the metric tool processing.
[xUnit] [INFO] - Processing GoogleTest-1.6
[xUnit] [INFO] - [GoogleTest-1.6] - No test report file(s) were found with the pattern 'test/gtest*xml' relative to '/home/jenkins/workspace/Leeroy' for the testing framework 'GoogleTest-1.6'.  Did you enter a pattern relative to the correct directory?  Did you generate the result report(s) for 'GoogleTest-1.6'?
[xUnit] [WARNING] - No test reports found for the metric 'GoogleTest' with the resolved pattern 'test/gtest*xml'.
[xUnit] [INFO] - Skipping the metric tool processing.
[xUnit] [INFO] - There are errors when processing test results.
[xUnit] [INFO] - Skipping tests recording.
Collecting metadata...
Metadata collection done.
Finished: FAILURE