log: glescts-test_m64_debug_tgl.log

Started by remote host ::1
Building remotely on tgl-04 (tgl tgl-b-step) in workspace /home/jenkins/workspace/Leeroy
 > git rev-parse --is-inside-work-tree # timeout=10
Fetching changes from 4 remote Git repositories
 > git config remote.local.url git://otc-mesa-ci.local/git/mesa_jenkins # timeout=10
Pruning obsolete local branches
Fetching upstream changes from git://otc-mesa-ci.local/git/mesa_jenkins
 > git --version # timeout=10
 > git fetch --tags --progress git://otc-mesa-ci.local/git/mesa_jenkins +refs/heads/*:refs/remotes/local/* --prune
 > git config remote.origin.url https://gitlab.freedesktop.org/Mesa_CI/mesa_jenkins.git # timeout=10
Pruning obsolete local branches
Fetching upstream changes from https://gitlab.freedesktop.org/Mesa_CI/mesa_jenkins.git
Setting http proxy: proxy.jf.intel.com:911
 > git fetch --tags --progress https://gitlab.freedesktop.org/Mesa_CI/mesa_jenkins.git +refs/heads/*:refs/remotes/origin/* --prune
 > git config remote.origin1.url https://gitlab.freedesktop.org/ngcortes/mesa_jenkins.git # timeout=10
Pruning obsolete local branches
Fetching upstream changes from https://gitlab.freedesktop.org/ngcortes/mesa_jenkins.git
Setting http proxy: proxy.jf.intel.com:911
 > git fetch --tags --progress https://gitlab.freedesktop.org/ngcortes/mesa_jenkins.git +refs/heads/*:refs/remotes/origin1/* --prune
 > git config remote.origin2.url https://gitlab.freedesktop.org/cmarcelo/mesa_jenkins.git # timeout=10
Pruning obsolete local branches
Fetching upstream changes from https://gitlab.freedesktop.org/cmarcelo/mesa_jenkins.git
Setting http proxy: proxy.jf.intel.com:911
 > git fetch --tags --progress https://gitlab.freedesktop.org/cmarcelo/mesa_jenkins.git +refs/heads/*:refs/remotes/origin2/* --prune
 > git rev-parse 70b9250182c7d3dbac817162daa90d628f536109^{commit} # timeout=10
Checking out Revision 70b9250182c7d3dbac817162daa90d628f536109 (detached)
 > git config core.sparsecheckout # timeout=10
 > git checkout -f 70b9250182c7d3dbac817162daa90d628f536109
 > git rev-list 70b9250182c7d3dbac817162daa90d628f536109 # timeout=10
Set build name.
New build name is 'glescts-test-curro-m64-tgl'
[Leeroy] $ /bin/sh -xe /tmp/hudson3110942945951419416.sh
+ python3 -u fetch_sources.py --project=glescts-test amber=aee124f7 cts=07bc5346e deqp=91bf58c5a drm=d77ccdf3 glcts=8c439f307 glslang=6abdde3c kc-cts=64f5eea mesa=72482ab2d2b mesa_ci=b9582f00 mesa_ci_internal=8d0201c piglit=83bc56abf2 spirvheaders=8bb2420 spirvtools=f37547c73 vkrunner=1b4cc6b waffle=0d3ac7c webgl=837205ca6
Checking out mesa_ci commit (try 1/15)
Checking out mesa_ci_internal commit (try 1/15)
Checking out specified commit (try 1/15)
+ ls /mnt/jenkins/results
+ mkdir -p /tmp/jenkins/6374257
+ [ tgl = builder ]
+ python3 -u glescts-test/build.py --arch m64 --result_path /mnt/jenkins/results/curro/3a6c4cd13141277e5b604f04c9cb08ef/percheckin --config debug --type percheckin --hardware tgl --action clean,build,test --shard 0 --env DISPLAY=:0  --startx
INFO: starting timer at: 1635458104.057171, time remaining is: 7199.999963521957
 rsync -rlpD --exclude='*.o' --exclude='*.a' otc-mesa-ci.local::nfs/results/curro/3a6c4cd13141277e5b604f04c9cb08ef/percheckin/mesa/m64 /tmp/build_root
 rsync -rlpD --exclude='*.o' --exclude='*.a' otc-mesa-ci.local::nfs/results/curro/3a6c4cd13141277e5b604f04c9cb08ef/percheckin/drm/m64 /tmp/build_root
 rsync -rlpD --exclude='*.o' --exclude='*.a' otc-mesa-ci.local::nfs/results/curro/3a6c4cd13141277e5b604f04c9cb08ef/percheckin/glescts/m64 /tmp/build_root
 rsync -rlpD --exclude='*.o' --exclude='*.a' otc-mesa-ci.local::nfs/results/curro/3a6c4cd13141277e5b604f04c9cb08ef/percheckin/waffle/m64 /tmp/build_root
 sudo ldconfig /tmp/build_root/m64/lib /tmp/build_root/m32/lib /tmp/build_root/m64/lib/dri /tmp/build_root/m32/lib/dri /tmp/build_root/m64/lib/x86_64-linux-gnu /tmp/build_root/m32/lib/i386-linux-gnu
 sudo chown -R jenkins /tmp/build_root
Deleting /tmp/orig_build_root
 cp -al /tmp/build_root /tmp/orig_build_root
Deleting /home/jenkins/workspace/Leeroy/test
Deleting /tmp/build_root/m64/../test
 killall Xorg
Xorg: no process found
LD_LIBRARY_PATH=/tmp/build_root/m64/lib64:/tmp/build_root/m64/lib/x86_64-linux-gnu:/tmp/build_root/m64/lib:/usr/lib64:/usr/lib/x86_64-linux-gnu:/usr/lib:/tmp/build_root/m64/lib64/dri:/tmp/build_root/m64/lib/x86_64-linux-gnu/dri:/tmp/build_root/m64/lib/dri:/usr/lib64/dri:/usr/lib/x86_64-linux-gnu/dri:/usr/lib/dri LIBGL_DRIVERS_PATH=/tmp/build_root/m64/lib64/dri:/tmp/build_root/m64/lib/x86_64-linux-gnu/dri:/tmp/build_root/m64/lib/dri:/usr/lib64/dri:/usr/lib/x86_64-linux-gnu/dri:/usr/lib/dri DISPLAY=:0 Xorg :0 vt0 -retro -sharevts -noreset

X.Org X Server 1.20.8
X Protocol Version 11, Revision 0
Build Operating System: Linux 4.19.0-8-amd64 x86_64 Debian
Current Operating System: Linux otc-gfxtest-tgl-04 5.9.0-rc4-amd64 #1 SMP Debian 5.9~rc4-1~exp1 (2020-09-11) x86_64
Kernel command line: BOOT_IMAGE=/boot/vmlinuz-5.9.0-rc4-amd64 root=UUID=db1c105a-3131-4d7c-8aba-391082dce34e ro pcie_aspm=off i915.force_probe=* noibrs noibpb nopti nospectre_v2 nospectre_v1 l1tf=off nospec_store_bypass_disable no_stf_barrier mds=off tsx=on tsx_async_abort=off mitigations=off quiet
Build Date: 31 March 2020  10:14:40AM
xorg-server 2:1.20.8-2 (https://www.debian.org/support) 
Current version of pixman: 0.36.0
	Before reporting problems, check http://wiki.x.org
	to make sure that you have the latest version.
Markers: (--) probed, (**) from config file, (==) default setting,
	(++) from command line, (!!) notice, (II) informational,
	(WW) warning, (EE) error, (NI) not implemented, (??) unknown.
(==) Log file: "/var/log/Xorg.0.log", Time: Thu Oct 28 14:55:24 2021
(==) Using config directory: "/etc/X11/xorg.conf.d"
(==) Using system config directory "/usr/share/X11/xorg.conf.d"
SUBSLICE MASK: 3f
PPIPES: 02 02 02 00 00 00 00 00 00 00 00 00 00 00 00 00
(EE) 
(EE) Backtrace:
(EE) 0: /usr/lib/xorg/Xorg (OsLookupColor+0x138) [0x55e421800e88]
(EE) 1: /lib/x86_64-linux-gnu/libpthread.so.0 (funlockfile+0x50) [0x7f770034118f]
(EE) 2: /lib/x86_64-linux-gnu/libc.so.6 (gsignal+0x141) [0x7f77001a1cb1]
(EE) 3: /lib/x86_64-linux-gnu/libc.so.6 (abort+0x123) [0x7f770018b537]
(EE) 4: /tmp/build_root/m64/lib/dri/iris_dri.so (update_from_topology+0x3d4) [0x7f76fea08734]
(EE) 5: /tmp/build_root/m64/lib/dri/iris_dri.so (intel_get_device_info_from_fd+0x589) [0x7f76fea122c9]
(EE) 6: /tmp/build_root/m64/lib/dri/iris_dri.so (iris_screen_create+0x7d) [0x7f76fe64aa9d]
(EE) 7: /tmp/build_root/m64/lib/dri/iris_dri.so (pipe_iris_create_screen+0x7) [0x7f76fdfbb3d7]
(EE) 8: /tmp/build_root/m64/lib/dri/iris_dri.so (pipe_loader_create_screen_vk+0x80) [0x7f76fe62d5c0]
(EE) 9: /tmp/build_root/m64/lib/dri/iris_dri.so (dri2_init_screen+0x72) [0x7f76fdfbc792]
(EE) 10: /tmp/build_root/m64/lib/dri/iris_dri.so (driCreateNewScreen2+0x220) [0x7f76fe580970]
(EE) 11: /tmp/build_root/m64/lib/libgbm.so.1 (dri_screen_create_dri2+0x116) [0x7f76ff6362d6]
(EE) 12: /tmp/build_root/m64/lib/libgbm.so.1 (dri_device_create+0x193) [0x7f76ff636683]
(EE) 13: /tmp/build_root/m64/lib/libgbm.so.1 (find_backend+0xcb) [0x7f76ff63476b]
(EE) 14: /tmp/build_root/m64/lib/libgbm.so.1 (gbm_create_device+0x38) [0x7f76ff6348a8]
(EE) 15: /usr/lib/xorg/modules/libglamoregl.so (glamor_egl_init+0x53) [0x7f76ff64b2a3]
(EE) unw_get_proc_name failed: no unwind info found [-10]
(EE) 16: /usr/lib/xorg/modules/drivers/modesetting_drv.so (?+0x0) [0x7f76ff888a60]
(EE) 17: /usr/lib/xorg/Xorg (InitOutput+0x9b4) [0x55e4216e47d4]
(EE) 18: /usr/lib/xorg/Xorg (InitFonts+0x1d4) [0x55e4216a7734]
(EE) 19: /lib/x86_64-linux-gnu/libc.so.6 (__libc_start_main+0xea) [0x7f770018ccca]
(EE) 20: /usr/lib/xorg/Xorg (_start+0x2a) [0x55e42169173a]
(EE) 
(EE) 
Fatal server error:
(EE) Caught signal 6 (Aborted). Server aborting
(EE) 
(EE) 
Please consult the The X.Org Foundation support 
	 at http://wiki.x.org
 for help. 
(EE) Please also check the log file at "/var/log/Xorg.0.log" for additional information.
(EE) 
(EE) Server terminated with error (1). Closing log file.
LD_LIBRARY_PATH=/tmp/build_root/m64/lib64:/tmp/build_root/m64/lib/x86_64-linux-gnu:/tmp/build_root/m64/lib:/usr/lib64:/usr/lib/x86_64-linux-gnu:/usr/lib:/tmp/build_root/m64/lib64/dri:/tmp/build_root/m64/lib/x86_64-linux-gnu/dri:/tmp/build_root/m64/lib/dri:/usr/lib64/dri:/usr/lib/x86_64-linux-gnu/dri:/usr/lib/dri LIBGL_DRIVERS_PATH=/tmp/build_root/m64/lib64/dri:/tmp/build_root/m64/lib/x86_64-linux-gnu/dri:/tmp/build_root/m64/lib/dri:/usr/lib64/dri:/usr/lib/x86_64-linux-gnu/dri:/usr/lib/dri DISPLAY=:0 xset dpms force on
xset:  unable to open display ":0"
LD_LIBRARY_PATH=/tmp/build_root/m64/lib64:/tmp/build_root/m64/lib/x86_64-linux-gnu:/tmp/build_root/m64/lib:/usr/lib64:/usr/lib/x86_64-linux-gnu:/usr/lib:/tmp/build_root/m64/lib64/dri:/tmp/build_root/m64/lib/x86_64-linux-gnu/dri:/tmp/build_root/m64/lib/dri:/usr/lib64/dri:/usr/lib/x86_64-linux-gnu/dri:/usr/lib/dri LIBGL_DRIVERS_PATH=/tmp/build_root/m64/lib64/dri:/tmp/build_root/m64/lib/x86_64-linux-gnu/dri:/tmp/build_root/m64/lib/dri:/usr/lib64/dri:/usr/lib/x86_64-linux-gnu/dri:/usr/lib/dri DISPLAY=:0 xset s off
xset:  unable to open display ":0"
Checking for support for gbm
LD_LIBRARY_PATH=/tmp/build_root/m64/lib64:/tmp/build_root/m64/lib/x86_64-linux-gnu:/tmp/build_root/m64/lib:/usr/lib64:/usr/lib/x86_64-linux-gnu:/usr/lib:/tmp/build_root/m64/lib64/dri:/tmp/build_root/m64/lib/x86_64-linux-gnu/dri:/tmp/build_root/m64/lib/dri:/usr/lib64/dri:/usr/lib/x86_64-linux-gnu/dri:/usr/lib/dri LIBGL_DRIVERS_PATH=/tmp/build_root/m64/lib64/dri:/tmp/build_root/m64/lib/x86_64-linux-gnu/dri:/tmp/build_root/m64/lib/dri:/usr/lib64/dri:/usr/lib/x86_64-linux-gnu/dri:/usr/lib/dri DISPLAY=:0 /tmp/build_root/m64/bin/wflinfo --platform=gbm -a gl
ERROR: command failed
STDERR: SUBSLICE MASK: 3f
PPIPES: 02 02 02 00 00 00 00 00 00 00 00 00 00 00 00 00

Command '['/tmp/build_root/m64/bin/wflinfo', '--platform=gbm', '-a', 'gl']' died with <Signals.SIGABRT: 6>.
ERROR: wflinfo failed
ERROR: creating a failing test: wflinfo-crash-otc-gfxtest-tgl-04 : wflinfo crashed!
 rsync -rlpD --exclude='*.o' --exclude='*.a' /tmp/build_root/test otc-mesa-ci.local::nfs/results/curro/3a6c4cd13141277e5b604f04c9cb08ef/percheckin
 cp -a /tmp/build_root/m64/../test /home/jenkins/workspace/Leeroy
Build step 'Execute shell' marked build as failure
Set build name.
New build name is 'glescts-test-curro-m64-tgl'
Variable with name 'BUILD_DISPLAY_NAME' already exists, current value: 'glescts-test-curro-m64-tgl', new value: 'glescts-test-curro-m64-tgl'
[WARNINGS] Skipping publisher since build result is FAILURE
Performing Post build task...
Match found for :python : True
Logical operation result is TRUE
Running script  : rm -rf /tmp/jenkins/${BUILD_NUMBER}
[Leeroy] $ /bin/sh -xe /tmp/hudson2180748267158508666.sh
+ rm -rf /tmp/jenkins/6374257
POST BUILD TASK : SUCCESS
END OF POST BUILD TASK : 0
[xUnit] [INFO] - Starting to record.
[xUnit] [INFO] - Processing JUnit
[xUnit] [INFO] - [JUnit] - 1 test report file(s) were found with the pattern 'test/piglit*xml' relative to '/home/jenkins/workspace/Leeroy' for the testing framework 'JUnit'.
[xUnit] [INFO] - Processing GoogleTest-1.6
[xUnit] [INFO] - [GoogleTest-1.6] - No test report file(s) were found with the pattern 'test/gtest*xml' relative to '/home/jenkins/workspace/Leeroy' for the testing framework 'GoogleTest-1.6'.  Did you enter a pattern relative to the correct directory?  Did you generate the result report(s) for 'GoogleTest-1.6'?
[xUnit] [WARNING] - No test reports found for the metric 'GoogleTest' with the resolved pattern 'test/gtest*xml'.
[xUnit] [INFO] - Skipping the metric tool processing.
[xUnit] [INFO] - Check 'Failed Tests' threshold.
[xUnit] [INFO] - The total number of tests for this category exceeds the specified 'unstable' threshold value.
[xUnit] [INFO] - Setting the build status to FAILURE
[xUnit] [INFO] - Stopping recording.
Collecting metadata...
Metadata collection done.
Finished: FAILURE