log: deqp-test_m64_debug_bdw_iris_1:4.log

Started by remote host ::1
Building remotely on bdwgt3e-03 (bdwgt3e bdw_iris bdw fastgpu) in workspace /home/jenkins/workspace/Leeroy
 > git rev-parse --is-inside-work-tree # timeout=10
Fetching changes from 4 remote Git repositories
 > git config remote.local.url git://otc-mesa-ci.local/git/mesa_jenkins # timeout=10
Pruning obsolete local branches
Fetching upstream changes from git://otc-mesa-ci.local/git/mesa_jenkins
 > git --version # timeout=10
 > git fetch --tags --progress git://otc-mesa-ci.local/git/mesa_jenkins +refs/heads/*:refs/remotes/local/* --prune
 > git config remote.origin.url https://gitlab.freedesktop.org/Mesa_CI/mesa_jenkins.git # timeout=10
Pruning obsolete local branches
Fetching upstream changes from https://gitlab.freedesktop.org/Mesa_CI/mesa_jenkins.git
Setting http proxy: proxy.jf.intel.com:911
 > git fetch --tags --progress https://gitlab.freedesktop.org/Mesa_CI/mesa_jenkins.git +refs/heads/*:refs/remotes/origin/* --prune
 > git config remote.origin1.url https://gitlab.freedesktop.org/ngcortes/mesa_jenkins.git # timeout=10
Pruning obsolete local branches
Fetching upstream changes from https://gitlab.freedesktop.org/ngcortes/mesa_jenkins.git
Setting http proxy: proxy.jf.intel.com:911
 > git fetch --tags --progress https://gitlab.freedesktop.org/ngcortes/mesa_jenkins.git +refs/heads/*:refs/remotes/origin1/* --prune
 > git config remote.origin2.url https://gitlab.freedesktop.org/cmarcelo/mesa_jenkins.git # timeout=10
Pruning obsolete local branches
Fetching upstream changes from https://gitlab.freedesktop.org/cmarcelo/mesa_jenkins.git
Setting http proxy: proxy.jf.intel.com:911
 > git fetch --tags --progress https://gitlab.freedesktop.org/cmarcelo/mesa_jenkins.git +refs/heads/*:refs/remotes/origin2/* --prune
 > git rev-parse 70b9250182c7d3dbac817162daa90d628f536109^{commit} # timeout=10
Checking out Revision 70b9250182c7d3dbac817162daa90d628f536109 (detached)
 > git config core.sparsecheckout # timeout=10
 > git checkout -f 70b9250182c7d3dbac817162daa90d628f536109
 > git rev-list 70b9250182c7d3dbac817162daa90d628f536109 # timeout=10
Set build name.
New build name is 'deqp-test-curro-m64-bdw_iris'
[Leeroy] $ /bin/sh -xe /tmp/hudson2697969677684370702.sh
+ python3 -u fetch_sources.py --project=deqp-test amber=aee124f7 cts=07bc5346e deqp=91bf58c5a drm=d77ccdf3 glcts=8c439f307 glslang=6abdde3c kc-cts=64f5eea mesa=72482ab2d2b mesa_ci=b9582f00 mesa_ci_internal=8d0201c piglit=83bc56abf2 spirvheaders=8bb2420 spirvtools=f37547c73 vkrunner=1b4cc6b waffle=0d3ac7c webgl=837205ca6
Checking out mesa_ci commit (try 1/15)
Checking out mesa_ci_internal commit (try 1/15)
Checking out specified commit (try 1/15)
+ ls /mnt/jenkins/results
+ mkdir -p /tmp/jenkins/6374190
+ [ bdw_iris = builder ]
+ python3 -u deqp-test/build.py --arch m64 --result_path /mnt/jenkins/results/curro/3a6c4cd13141277e5b604f04c9cb08ef/percheckin --config debug --type percheckin --hardware bdw_iris --action clean,build,test --shard 1:4 --env DISPLAY=:0  --startx
INFO: starting timer at: 1635457475.3863716, time remaining is: 29999.999981164932
 rsync -rlpD --exclude='*.o' --exclude='*.a' otc-mesa-ci.local::nfs/results/curro/3a6c4cd13141277e5b604f04c9cb08ef/percheckin/deqp/m64 /tmp/build_root
 rsync -rlpD --exclude='*.o' --exclude='*.a' otc-mesa-ci.local::nfs/results/curro/3a6c4cd13141277e5b604f04c9cb08ef/percheckin/mesa/m64 /tmp/build_root
 rsync -rlpD --exclude='*.o' --exclude='*.a' otc-mesa-ci.local::nfs/results/curro/3a6c4cd13141277e5b604f04c9cb08ef/percheckin/drm/m64 /tmp/build_root
 rsync -rlpD --exclude='*.o' --exclude='*.a' otc-mesa-ci.local::nfs/results/curro/3a6c4cd13141277e5b604f04c9cb08ef/percheckin/waffle/m64 /tmp/build_root
Deleting /tmp/orig_build_root
 cp -al /tmp/build_root /tmp/orig_build_root
Deleting /home/jenkins/workspace/Leeroy/test
Deleting /tmp/build_root/m64/../test
 killall Xorg
Xorg: no process found
LD_LIBRARY_PATH=/tmp/build_root/m64/lib64:/tmp/build_root/m64/lib/x86_64-linux-gnu:/tmp/build_root/m64/lib:/usr/lib64:/usr/lib/x86_64-linux-gnu:/usr/lib:/tmp/build_root/m64/lib64/dri:/tmp/build_root/m64/lib/x86_64-linux-gnu/dri:/tmp/build_root/m64/lib/dri:/usr/lib64/dri:/usr/lib/x86_64-linux-gnu/dri:/usr/lib/dri LIBGL_DRIVERS_PATH=/tmp/build_root/m64/lib64/dri:/tmp/build_root/m64/lib/x86_64-linux-gnu/dri:/tmp/build_root/m64/lib/dri:/usr/lib64/dri:/usr/lib/x86_64-linux-gnu/dri:/usr/lib/dri MESA_LOADER_DRIVER_OVERRIDE=iris DISPLAY=:0 Xorg :0 vt0 -retro -sharevts -noreset

X.Org X Server 1.20.8
X Protocol Version 11, Revision 0
Build Operating System: Linux 4.19.0-8-amd64 x86_64 Debian
Current Operating System: Linux otc-gfxtest-bdwgt3e-03 4.19.1revert-mem+ #26 SMP Fri Nov 22 17:11:45 PST 2019 x86_64
Kernel command line: BOOT_IMAGE=/boot/vmlinuz-4.19.1revert-mem+ root=UUID=756f67dc-e5f6-4f41-a92d-c16d96e9505a ro pcie_aspm=off i915.force_probe=* noibrs noibpb nopti nospectre_v2 nospectre_v1 l1tf=off nospec_store_bypass_disable no_stf_barrier mds=off tsx=on tsx_async_abort=off mitigations=off quiet
Build Date: 31 March 2020  10:14:40AM
xorg-server 2:1.20.8-2 (https://www.debian.org/support) 
Current version of pixman: 0.34.0
	Before reporting problems, check http://wiki.x.org
	to make sure that you have the latest version.
Markers: (--) probed, (**) from config file, (==) default setting,
	(++) from command line, (!!) notice, (II) informational,
	(WW) warning, (EE) error, (NI) not implemented, (??) unknown.
(==) Log file: "/var/log/Xorg.0.log", Time: Thu Oct 28 14:45:15 2021
(==) Using config directory: "/etc/X11/xorg.conf.d"
(==) Using system config directory "/usr/share/X11/xorg.conf.d"
(II) modeset(0): Initializing kms color map for depth 24, 8 bpc.
LD_LIBRARY_PATH=/tmp/build_root/m64/lib64:/tmp/build_root/m64/lib/x86_64-linux-gnu:/tmp/build_root/m64/lib:/usr/lib64:/usr/lib/x86_64-linux-gnu:/usr/lib:/tmp/build_root/m64/lib64/dri:/tmp/build_root/m64/lib/x86_64-linux-gnu/dri:/tmp/build_root/m64/lib/dri:/usr/lib64/dri:/usr/lib/x86_64-linux-gnu/dri:/usr/lib/dri LIBGL_DRIVERS_PATH=/tmp/build_root/m64/lib64/dri:/tmp/build_root/m64/lib/x86_64-linux-gnu/dri:/tmp/build_root/m64/lib/dri:/usr/lib64/dri:/usr/lib/x86_64-linux-gnu/dri:/usr/lib/dri MESA_LOADER_DRIVER_OVERRIDE=iris DISPLAY=:0 xset dpms force on
LD_LIBRARY_PATH=/tmp/build_root/m64/lib64:/tmp/build_root/m64/lib/x86_64-linux-gnu:/tmp/build_root/m64/lib:/usr/lib64:/usr/lib/x86_64-linux-gnu:/usr/lib:/tmp/build_root/m64/lib64/dri:/tmp/build_root/m64/lib/x86_64-linux-gnu/dri:/tmp/build_root/m64/lib/dri:/usr/lib64/dri:/usr/lib/x86_64-linux-gnu/dri:/usr/lib/dri LIBGL_DRIVERS_PATH=/tmp/build_root/m64/lib64/dri:/tmp/build_root/m64/lib/x86_64-linux-gnu/dri:/tmp/build_root/m64/lib/dri:/usr/lib64/dri:/usr/lib/x86_64-linux-gnu/dri:/usr/lib/dri MESA_LOADER_DRIVER_OVERRIDE=iris DISPLAY=:0 xset s off
Checking for support for gbm
LD_LIBRARY_PATH=/tmp/build_root/m64/lib64:/tmp/build_root/m64/lib/x86_64-linux-gnu:/tmp/build_root/m64/lib:/usr/lib64:/usr/lib/x86_64-linux-gnu:/usr/lib:/tmp/build_root/m64/lib64/dri:/tmp/build_root/m64/lib/x86_64-linux-gnu/dri:/tmp/build_root/m64/lib/dri:/usr/lib64/dri:/usr/lib/x86_64-linux-gnu/dri:/usr/lib/dri LIBGL_DRIVERS_PATH=/tmp/build_root/m64/lib64/dri:/tmp/build_root/m64/lib/x86_64-linux-gnu/dri:/tmp/build_root/m64/lib/dri:/usr/lib64/dri:/usr/lib/x86_64-linux-gnu/dri:/usr/lib/dri MESA_LOADER_DRIVER_OVERRIDE=iris DISPLAY=:0 /tmp/build_root/m64/bin/wflinfo --platform=gbm -a gl
ERROR: command failed
STDERR: SUBSLICE MASK: 07 07 00
PPIPES: 00 00 00 00 00 00 00 00 00 00 00 00 00 00 00 00

Command '['/tmp/build_root/m64/bin/wflinfo', '--platform=gbm', '-a', 'gl']' died with <Signals.SIGABRT: 6>.
ERROR: wflinfo failed
ERROR: creating a failing test: wflinfo-crash-otc-gfxtest-bdwgt3e-03 : wflinfo crashed!
 rsync -rlpD --exclude='*.o' --exclude='*.a' /tmp/build_root/test otc-mesa-ci.local::nfs/results/curro/3a6c4cd13141277e5b604f04c9cb08ef/percheckin
 cp -a /tmp/build_root/m64/../test /home/jenkins/workspace/Leeroy
Build step 'Execute shell' marked build as failure
Set build name.
New build name is 'deqp-test-curro-m64-bdw_iris'
Variable with name 'BUILD_DISPLAY_NAME' already exists, current value: 'deqp-test-curro-m64-bdw_iris', new value: 'deqp-test-curro-m64-bdw_iris'
[WARNINGS] Skipping publisher since build result is FAILURE
Performing Post build task...
Match found for :python : True
Logical operation result is TRUE
Running script  : rm -rf /tmp/jenkins/${BUILD_NUMBER}
[Leeroy] $ /bin/sh -xe /tmp/hudson946117530632659938.sh
+ rm -rf /tmp/jenkins/6374190
POST BUILD TASK : SUCCESS
END OF POST BUILD TASK : 0
[xUnit] [INFO] - Starting to record.
[xUnit] [INFO] - Processing JUnit
[xUnit] [INFO] - [JUnit] - 1 test report file(s) were found with the pattern 'test/piglit*xml' relative to '/home/jenkins/workspace/Leeroy' for the testing framework 'JUnit'.
[xUnit] [INFO] - Processing GoogleTest-1.6
[xUnit] [INFO] - [GoogleTest-1.6] - No test report file(s) were found with the pattern 'test/gtest*xml' relative to '/home/jenkins/workspace/Leeroy' for the testing framework 'GoogleTest-1.6'.  Did you enter a pattern relative to the correct directory?  Did you generate the result report(s) for 'GoogleTest-1.6'?
[xUnit] [WARNING] - No test reports found for the metric 'GoogleTest' with the resolved pattern 'test/gtest*xml'.
[xUnit] [INFO] - Skipping the metric tool processing.
[xUnit] [INFO] - Check 'Failed Tests' threshold.
[xUnit] [INFO] - The total number of tests for this category exceeds the specified 'unstable' threshold value.
[xUnit] [INFO] - Setting the build status to FAILURE
[xUnit] [INFO] - Stopping recording.
Collecting metadata...
Metadata collection done.
Finished: FAILURE