log: mesa-buildtest_m64_debug_builder.log

Started by remote host ::1
Building remotely on builder-02 (builder) in workspace /home/jenkins/workspace/Leeroy_3
 > git rev-parse --is-inside-work-tree # timeout=10
Fetching changes from 4 remote Git repositories
 > git config remote.local.url git://otc-mesa-ci.local/git/mesa_jenkins # timeout=10
Pruning obsolete local branches
Fetching upstream changes from git://otc-mesa-ci.local/git/mesa_jenkins
 > git --version # timeout=10
 > git fetch --tags --progress git://otc-mesa-ci.local/git/mesa_jenkins +refs/heads/*:refs/remotes/local/* --prune
 > git config remote.origin.url https://gitlab.freedesktop.org/Mesa_CI/mesa_jenkins.git # timeout=10
Pruning obsolete local branches
Fetching upstream changes from https://gitlab.freedesktop.org/Mesa_CI/mesa_jenkins.git
Setting http proxy: proxy.jf.intel.com:911
 > git fetch --tags --progress https://gitlab.freedesktop.org/Mesa_CI/mesa_jenkins.git +refs/heads/*:refs/remotes/origin/* --prune
 > git config remote.origin1.url https://gitlab.freedesktop.org/majanes/mesa_jenkins.git # timeout=10
Pruning obsolete local branches
Fetching upstream changes from https://gitlab.freedesktop.org/majanes/mesa_jenkins.git
Setting http proxy: proxy.jf.intel.com:911
 > git fetch --tags --progress https://gitlab.freedesktop.org/majanes/mesa_jenkins.git +refs/heads/*:refs/remotes/origin1/* --prune
 > git config remote.origin2.url https://gitlab.freedesktop.org/ngcortes/mesa_jenkins.git # timeout=10
Pruning obsolete local branches
Fetching upstream changes from https://gitlab.freedesktop.org/ngcortes/mesa_jenkins.git
Setting http proxy: proxy.jf.intel.com:911
 > git fetch --tags --progress https://gitlab.freedesktop.org/ngcortes/mesa_jenkins.git +refs/heads/*:refs/remotes/origin2/* --prune
 > git rev-parse 937a7dbea38bbb86fd03e19abd9dec7f7b647696^{commit} # timeout=10
Checking out Revision 937a7dbea38bbb86fd03e19abd9dec7f7b647696 (detached)
 > git config core.sparsecheckout # timeout=10
 > git checkout -f 937a7dbea38bbb86fd03e19abd9dec7f7b647696
 > git rev-list 937a7dbea38bbb86fd03e19abd9dec7f7b647696 # timeout=10
Set build name.
New build name is 'mesa-buildtest-itoral-m64-builder'
[Leeroy_3] $ /bin/sh -xe /tmp/hudson7664378829893884602.sh
+ python3 -u fetch_sources.py --project=mesa-buildtest amber=dabae26 crucible=d03f3fd cts=07bc5346e deqp=91bf58c5a drm=a7892962 glcts=8c439f307 glslang=51d672b8 kc-cts=64f5eea mesa=5f4d9b419a1 mesa_ci=40091620 mesa_ci_internal=83402dd piglit=c97da22d35 spirvheaders=a3fdfe8 spirvtools=ef3290bbe vkrunner=1b4cc6b vulkancts=39e596640 waffle=0a1fb6f webgl=619c1194e
Checking out mesa_ci commit (try 1/15)
Checking out mesa_ci_internal commit (try 1/15)
Checking out specified commit (try 1/15)
+ ls /mnt/jenkins/results
+ mkdir -p /tmp/jenkins/6197344
+ [ builder = builder ]
+ unshare -m -r /bin/bash -c 
mount -o bind /tmp/jenkins/6197344 /tmp
unset revision
python3 -u mesa-buildtest/build.py --arch m64 --result_path /mnt/jenkins/results/itoral/ed3069e6f1beb54ebee124afd11529b5/percheckin --config debug --type percheckin --hardware builder --action clean,build,test --shard 0 --env "" 

INFO: starting timer at: 1630046482.787495, time remaining is: 1499.9999825954437
 rsync -rlpD --exclude='*.o' --exclude='*.a' otc-mesa-ci.local::nfs/results/itoral/ed3069e6f1beb54ebee124afd11529b5/percheckin/drm/m64 /tmp/build_root
 cp -al /tmp/build_root /tmp/orig_build_root
 git clean -xfd
Removing build_mesa-buildtest_m64/
Removing src/amd/compiler/__pycache__/
Removing src/amd/registers/__pycache__/
Removing src/asahi/
Removing src/compiler/nir/__pycache__/
Removing src/gallium/auxiliary/util/__pycache__/
Removing src/intel/genxml/__pycache__/
Removing src/mapi/glapi/gen/__pycache__/
Removing src/mapi/new/__pycache__/
Removing src/mesa/main/__pycache__/
Removing src/util/format/__pycache__/
Removing src/vulkan/util/__pycache__/
 git reset --hard HEAD
Updating files:  68% (5105/7458)
Updating files:  69% (5147/7458)
Updating files:  70% (5221/7458)
Updating files:  71% (5296/7458)
Updating files:  72% (5370/7458)
Updating files:  73% (5445/7458)
Updating files:  74% (5519/7458)
Updating files:  75% (5594/7458)
Updating files:  76% (5669/7458)
Updating files:  77% (5743/7458)
Updating files:  78% (5818/7458)
Updating files:  79% (5892/7458)
Updating files:  80% (5967/7458)
Updating files:  81% (6041/7458)
Updating files:  82% (6116/7458)
Updating files:  83% (6191/7458)
Updating files:  84% (6265/7458)
Updating files:  85% (6340/7458)
Updating files:  86% (6414/7458)
Updating files:  87% (6489/7458)
Updating files:  88% (6564/7458)
Updating files:  89% (6638/7458)
Updating files:  90% (6713/7458)
Updating files:  91% (6787/7458)
Updating files:  92% (6862/7458)
Updating files:  93% (6936/7458)
Updating files:  94% (7011/7458)
Updating files:  95% (7086/7458)
Updating files:  96% (7160/7458)
Updating files:  97% (7235/7458)
Updating files:  98% (7309/7458)
Updating files:  99% (7384/7458)
Updating files: 100% (7458/7458)
Updating files: 100% (7458/7458), done.
HEAD is now at 5f4d9b419a1c scons: prune unused Makefile.sources
PKG_CONFIG_PATH=/tmp/build_root/m64/lib64/pkgconfig:/tmp/build_root/m64/lib/x86_64-linux-gnu/pkgconfig:/tmp/build_root/m64/lib/pkgconfig:/usr/lib64/pkgconfig:/usr/lib/x86_64-linux-gnu/pkgconfig:/usr/lib/pkgconfig CC=ccache gcc CXX=ccache g++ LD_LIBRARY_PATH=/tmp/build_root/m64/lib64:/tmp/build_root/m64/lib/x86_64-linux-gnu:/tmp/build_root/m64/lib:/usr/lib64:/usr/lib/x86_64-linux-gnu:/usr/lib meson /home/jenkins/workspace/Leeroy_3/repos/mesa/build_mesa-buildtest_m64 --prefix /tmp/build_root/m64 --libdir lib -Dbuild-tests=true -Dgallium-drivers=,lima,radeonsi,virgl,kmsro,auto,v3d,etnaviv,iris,nouveau,tegra,r600,swr,freedreno,vc4,panfrost,r300,svga,swrast,zink -Dgallium-vdpau=true -Dgallium-xvmc=true -Dgallium-xa=true -Dgallium-va=true -Dgallium-nine=true -Dgallium-opencl=standalone -Dtools=all -Dgallium-omx=bellagio
Using 'PKG_CONFIG_PATH' from environment with value: '/tmp/build_root/m64/lib64/pkgconfig:/tmp/build_root/m64/lib/x86_64-linux-gnu/pkgconfig:/tmp/build_root/m64/lib/pkgconfig:/usr/lib64/pkgconfig:/usr/lib/x86_64-linux-gnu/pkgconfig:/usr/lib/pkgconfig'
Using 'PKG_CONFIG_PATH' from environment with value: '/tmp/build_root/m64/lib64/pkgconfig:/tmp/build_root/m64/lib/x86_64-linux-gnu/pkgconfig:/tmp/build_root/m64/lib/pkgconfig:/usr/lib64/pkgconfig:/usr/lib/x86_64-linux-gnu/pkgconfig:/usr/lib/pkgconfig'
The Meson build system
Version: 0.56.2
Source dir: /home/jenkins/workspace/Leeroy_3/repos/mesa
Build dir: /home/jenkins/workspace/Leeroy_3/repos/mesa/build_mesa-buildtest_m64
Build type: native build
Program python found: YES (/usr/bin/python)
Project name: mesa
Project version: 20.1.0-devel
Using 'CC' from environment with value: 'ccache gcc'
C compiler for the host machine: ccache gcc (gcc 10.2.1 "gcc (Debian 10.2.1-6) 10.2.1 20210110")
C linker for the host machine: gcc ld.bfd 2.35.2
Using 'CXX' from environment with value: 'ccache g++'
C++ compiler for the host machine: ccache g++ (gcc 10.2.1 "g++ (Debian 10.2.1-6) 10.2.1 20210110")
C++ linker for the host machine: g++ ld.bfd 2.35.2
Using 'CC' from environment with value: 'ccache gcc'
Using 'CXX' from environment with value: 'ccache g++'
Host machine cpu family: x86_64
Host machine cpu: x86_64
Program pkg-config found: YES (/usr/bin/pkg-config)
Found pkg-config: /usr/bin/pkg-config (0.29.2)
Using 'PKG_CONFIG_PATH' from environment with value: '/tmp/build_root/m64/lib64/pkgconfig:/tmp/build_root/m64/lib/x86_64-linux-gnu/pkgconfig:/tmp/build_root/m64/lib/pkgconfig:/usr/lib64/pkgconfig:/usr/lib/x86_64-linux-gnu/pkgconfig:/usr/lib/pkgconfig'
Run-time dependency vdpau found: YES 1.4
Using 'PKG_CONFIG_PATH' from environment with value: '/tmp/build_root/m64/lib64/pkgconfig:/tmp/build_root/m64/lib/x86_64-linux-gnu/pkgconfig:/tmp/build_root/m64/lib/pkgconfig:/usr/lib64/pkgconfig:/usr/lib/x86_64-linux-gnu/pkgconfig:/usr/lib/pkgconfig'
Run-time dependency xvmc found: YES 1.0.12
Using 'PKG_CONFIG_PATH' from environment with value: '/tmp/build_root/m64/lib64/pkgconfig:/tmp/build_root/m64/lib/x86_64-linux-gnu/pkgconfig:/tmp/build_root/m64/lib/pkgconfig:/usr/lib64/pkgconfig:/usr/lib/x86_64-linux-gnu/pkgconfig:/usr/lib/pkgconfig'
Run-time dependency xv found: YES 1.0.11
Using 'PKG_CONFIG_PATH' from environment with value: '/tmp/build_root/m64/lib64/pkgconfig:/tmp/build_root/m64/lib/x86_64-linux-gnu/pkgconfig:/tmp/build_root/m64/lib/pkgconfig:/usr/lib64/pkgconfig:/usr/lib/x86_64-linux-gnu/pkgconfig:/usr/lib/pkgconfig'
Run-time dependency libomxil-bellagio found: YES 0.9.3
Using 'PKG_CONFIG_PATH' from environment with value: '/tmp/build_root/m64/lib64/pkgconfig:/tmp/build_root/m64/lib/x86_64-linux-gnu/pkgconfig:/tmp/build_root/m64/lib/pkgconfig:/usr/lib64/pkgconfig:/usr/lib/x86_64-linux-gnu/pkgconfig:/usr/lib/pkgconfig'
Run-time dependency libva found: YES 1.10.0
Using 'PKG_CONFIG_PATH' from environment with value: '/tmp/build_root/m64/lib64/pkgconfig:/tmp/build_root/m64/lib/x86_64-linux-gnu/pkgconfig:/tmp/build_root/m64/lib/pkgconfig:/usr/lib64/pkgconfig:/usr/lib/x86_64-linux-gnu/pkgconfig:/usr/lib/pkgconfig'
Run-time dependency libclc found: YES 0.2.0
Program python3 found: YES (/usr/bin/python3)
Fetching value of define "ETIME" : 62 
Checking for function "bswap32" : YES 
Checking for function "bswap64" : YES 
Checking for function "clz" : YES 
Checking for function "clzll" : YES 
Checking for function "ctz" : YES 
Checking for function "expect" : YES 
Checking for function "ffs" : YES 
Checking for function "ffsll" : YES 
Checking for function "popcount" : YES 
Checking for function "popcountll" : YES 
Checking for function "unreachable" : YES 
Checking if "__attribute__((const))" compiles: YES 
Checking if "__attribute__((flatten))" compiles: YES 
Checking if "__attribute__((malloc))" compiles: YES 
Checking if "__attribute__((pure))" compiles: YES 
Checking if "__attribute__((unused))" compiles: YES 
Checking if "__attribute__((warn_unused_result))" compiles: YES 
Checking if "__attribute__((weak))" compiles: YES 
Checking if "__attribute__((format(...)))" compiles: YES 
Checking if "__attribute__((packed))" compiles: YES 
Checking if "__attribute__((returns_nonnull))" compiles: YES 
Checking if "__attribute__((visibility(...)))" compiles: YES 
Checking if "__attribute__((alias(...)))" compiles: YES 
Checking if "__attribute__((__noreturn__))" compiles: YES 
Checking if "__uint128_t" compiles: YES 
Compiler for C supports arguments -Werror=implicit-function-declaration: YES 
Compiler for C supports arguments -Werror=missing-prototypes: YES 
Compiler for C supports arguments -Werror=return-type: YES 
Compiler for C supports arguments -Werror=empty-body: YES 
Compiler for C supports arguments -Werror=incompatible-pointer-types: YES 
Compiler for C supports arguments -Werror=int-conversion: YES 
Compiler for C supports arguments -Wno-missing-field-initializers: YES 
Compiler for C supports arguments -Wno-format-truncation: YES 
Compiler for C supports arguments -fno-math-errno: YES 
Compiler for C supports arguments -fno-trapping-math: YES 
Compiler for C supports arguments -Qunused-arguments: NO 
Compiler for C supports arguments -fno-common: YES 
Compiler for C supports arguments -Werror=format: YES 
Compiler for C supports arguments -Wformat-security: YES 
Compiler for C++ supports arguments -Werror=return-type: YES 
Compiler for C++ supports arguments -Werror=empty-body: YES 
Compiler for C++ supports arguments -Wno-non-virtual-dtor: YES 
Compiler for C++ supports arguments -Wno-missing-field-initializers: YES 
Compiler for C++ supports arguments -Wno-format-truncation: YES 
Compiler for C++ supports arguments -fno-math-errno: YES 
Compiler for C++ supports arguments -fno-trapping-math: YES 
Compiler for C++ supports arguments -Qunused-arguments: NO 
Compiler for C++ supports arguments -Werror=format: YES 
Compiler for C++ supports arguments -Wformat-security: YES 
Compiler for C supports arguments -Wno-override-init: YES 
Compiler for C supports arguments -Wno-initializer-overrides: NO 
Compiler for C supports arguments -fvisibility=hidden: YES 
Compiler for C supports arguments -Werror=pointer-arith: YES 
Compiler for C++ supports arguments -Werror=pointer-arith: YES 
Compiler for C supports arguments -Werror=vla: YES 
Compiler for C++ supports arguments -Werror=vla: YES 
Compiler for C supports arguments -Werror=gnu-empty-initializer: NO 
Compiler for C++ supports arguments -Werror=gnu-empty-initializer: NO 
Compiler for C++ supports arguments -fvisibility=hidden: YES 
Checking if "GCC atomic builtins" compiles: YES 
Checking if "GCC atomic builtins required -latomic" links: YES 
Checking if "GCC 64bit atomics" with dependency not-found links: YES 
Library ws2_32 found: NO
Header <sys/sysmacros.h> has symbol "major" : YES 
Header <sys/sysmacros.h> has symbol "minor" : YES 
Header <sys/sysmacros.h> has symbol "makedev" : YES 
Header <sys/mkdev.h> has symbol "major" : NO 
Checking if "xlocale.h" compiles: NO 
Checking if "sys/sysctl.h" compiles: YES 
Checking if "linux/futex.h" compiles: YES 
Checking if "endian.h" compiles: YES 
Checking if "dlfcn.h" compiles: YES 
Checking if "execinfo.h" compiles: YES 
Checking if "sys/shm.h" compiles: YES 
Checking if "cet.h" compiles: YES 
Checking for function "strtof" : YES 
Checking for function "mkostemp" : YES 
Checking for function "timespec_get" : YES 
Checking for function "memfd_create" : YES 
Checking for function "random_r" : YES 
Checking for function "flock" : YES 
Checking for function "strtok_r" : YES 
Header <errno.h> has symbol "program_invocation_name" : YES 
Checking for function "posix_memalign" : YES 
Checking whether type "struct dirent" has member "d_type" : YES 
Checking if "strtod has locale support" links: YES 
Checking if "Bsymbolic" links: YES 
Checking if "gc-sections" links: YES 
Checking if "version-script" links: YES 
Checking if "dynamic-list" links: YES 
Compiler for C supports link arguments -Wl,--build-id=sha1: YES 
Checking for function "dlopen" : NO 
Library dl found: YES
Checking for function "dladdr" with dependency -ldl: YES 
Checking for function "dl_iterate_phdr" : YES 
Checking for function "clock_gettime" : YES 
Using 'PKG_CONFIG_PATH' from environment with value: '/tmp/build_root/m64/lib64/pkgconfig:/tmp/build_root/m64/lib/x86_64-linux-gnu/pkgconfig:/tmp/build_root/m64/lib/pkgconfig:/usr/lib64/pkgconfig:/usr/lib/x86_64-linux-gnu/pkgconfig:/usr/lib/pkgconfig'
Run-time dependency zlib found: YES 1.2.11
Using 'PKG_CONFIG_PATH' from environment with value: '/tmp/build_root/m64/lib64/pkgconfig:/tmp/build_root/m64/lib/x86_64-linux-gnu/pkgconfig:/tmp/build_root/m64/lib/pkgconfig:/usr/lib64/pkgconfig:/usr/lib/x86_64-linux-gnu/pkgconfig:/usr/lib/pkgconfig'
Run-time dependency libzstd found: YES 1.4.8
Run-time dependency threads found: YES
Checking for function "pthread_setaffinity_np" with dependency threads: YES 
Checking for function "pthread_setaffinity_np" with dependency threads: NO 
Using 'PKG_CONFIG_PATH' from environment with value: '/tmp/build_root/m64/lib64/pkgconfig:/tmp/build_root/m64/lib/x86_64-linux-gnu/pkgconfig:/tmp/build_root/m64/lib/pkgconfig:/usr/lib64/pkgconfig:/usr/lib/x86_64-linux-gnu/pkgconfig:/usr/lib/pkgconfig'
Run-time dependency expat found: YES 2.2.10
Library m found: YES
Message: libdrm 2.4.100 needed because amdgpu has the highest requirement
Using 'PKG_CONFIG_PATH' from environment with value: '/tmp/build_root/m64/lib64/pkgconfig:/tmp/build_root/m64/lib/x86_64-linux-gnu/pkgconfig:/tmp/build_root/m64/lib/pkgconfig:/usr/lib64/pkgconfig:/usr/lib/x86_64-linux-gnu/pkgconfig:/usr/lib/pkgconfig'
Run-time dependency libdrm_intel found: YES 2.4.107
Using 'PKG_CONFIG_PATH' from environment with value: '/tmp/build_root/m64/lib64/pkgconfig:/tmp/build_root/m64/lib/x86_64-linux-gnu/pkgconfig:/tmp/build_root/m64/lib/pkgconfig:/usr/lib64/pkgconfig:/usr/lib/x86_64-linux-gnu/pkgconfig:/usr/lib/pkgconfig'
Run-time dependency libdrm_amdgpu found: YES 2.4.107
Using 'PKG_CONFIG_PATH' from environment with value: '/tmp/build_root/m64/lib64/pkgconfig:/tmp/build_root/m64/lib/x86_64-linux-gnu/pkgconfig:/tmp/build_root/m64/lib/pkgconfig:/usr/lib64/pkgconfig:/usr/lib/x86_64-linux-gnu/pkgconfig:/usr/lib/pkgconfig'
Run-time dependency libdrm_radeon found: YES 2.4.107
Using 'PKG_CONFIG_PATH' from environment with value: '/tmp/build_root/m64/lib64/pkgconfig:/tmp/build_root/m64/lib/x86_64-linux-gnu/pkgconfig:/tmp/build_root/m64/lib/pkgconfig:/usr/lib64/pkgconfig:/usr/lib/x86_64-linux-gnu/pkgconfig:/usr/lib/pkgconfig'
Run-time dependency libdrm_nouveau found: YES 2.4.107
Using 'PKG_CONFIG_PATH' from environment with value: '/tmp/build_root/m64/lib64/pkgconfig:/tmp/build_root/m64/lib/x86_64-linux-gnu/pkgconfig:/tmp/build_root/m64/lib/pkgconfig:/usr/lib64/pkgconfig:/usr/lib/x86_64-linux-gnu/pkgconfig:/usr/lib/pkgconfig'
Run-time dependency libdrm found: YES 2.4.107
llvm-config found: YES (/usr/bin/llvm-config) 11.0.1
Run-time dependency LLVM (modules: all-targets, amdgpu, asmparser, bitreader, bitwriter, core, coverage, engine, executionengine, instcombine, instrumentation, ipo, irreader, linker, lto, mcdisassembler, mcjit, native, objcarcopts, option, profiledata, scalaropts, transformutils, coroutines) found: YES 11.0.1
Using 'PKG_CONFIG_PATH' from environment with value: '/tmp/build_root/m64/lib64/pkgconfig:/tmp/build_root/m64/lib/x86_64-linux-gnu/pkgconfig:/tmp/build_root/m64/lib/pkgconfig:/usr/lib64/pkgconfig:/usr/lib/x86_64-linux-gnu/pkgconfig:/usr/lib/pkgconfig'
Run-time dependency libelf found: YES 0.183
Using 'PKG_CONFIG_PATH' from environment with value: '/tmp/build_root/m64/lib64/pkgconfig:/tmp/build_root/m64/lib/x86_64-linux-gnu/pkgconfig:/tmp/build_root/m64/lib/pkgconfig:/usr/lib64/pkgconfig:/usr/lib/x86_64-linux-gnu/pkgconfig:/usr/lib/pkgconfig'
Run-time dependency valgrind found: YES 3.16.1
Program bison found: YES (/usr/bin/bison)
WARNING: Project targeting '>= 0.46' but tried to use feature introduced in '0.52.0': version arg in find_program.
Program bison found: YES 3.7.5 (/usr/bin/bison)
Program flex found: YES (/usr/bin/flex)
Found CMake: /usr/bin/cmake (3.18.4)
Run-time dependency libunwind found: NO (tried pkgconfig and cmake)
Found pkg-config: /usr/bin/pkg-config (0.29.2)
Using 'PKG_CONFIG_PATH' from environment with value: '/tmp/build_root/m64/lib64/pkgconfig:/tmp/build_root/m64/lib/x86_64-linux-gnu/pkgconfig:/tmp/build_root/m64/lib/pkgconfig:/usr/lib64/pkgconfig:/usr/lib/x86_64-linux-gnu/pkgconfig:/usr/lib/pkgconfig'
Build-time dependency wayland-scanner found: YES 1.18.0
Program /usr/bin/wayland-scanner found: YES (/usr/bin/wayland-scanner)
Using 'PKG_CONFIG_PATH' from environment with value: '/tmp/build_root/m64/lib64/pkgconfig:/tmp/build_root/m64/lib/x86_64-linux-gnu/pkgconfig:/tmp/build_root/m64/lib/pkgconfig:/usr/lib64/pkgconfig:/usr/lib/x86_64-linux-gnu/pkgconfig:/usr/lib/pkgconfig'
Run-time dependency wayland-protocols found: YES 1.20
Using 'PKG_CONFIG_PATH' from environment with value: '/tmp/build_root/m64/lib64/pkgconfig:/tmp/build_root/m64/lib/x86_64-linux-gnu/pkgconfig:/tmp/build_root/m64/lib/pkgconfig:/usr/lib64/pkgconfig:/usr/lib/x86_64-linux-gnu/pkgconfig:/usr/lib/pkgconfig'
Run-time dependency wayland-client found: YES 1.18.0
Using 'PKG_CONFIG_PATH' from environment with value: '/tmp/build_root/m64/lib64/pkgconfig:/tmp/build_root/m64/lib/x86_64-linux-gnu/pkgconfig:/tmp/build_root/m64/lib/pkgconfig:/usr/lib64/pkgconfig:/usr/lib/x86_64-linux-gnu/pkgconfig:/usr/lib/pkgconfig'
Run-time dependency wayland-server found: YES 1.18.0
Using 'PKG_CONFIG_PATH' from environment with value: '/tmp/build_root/m64/lib64/pkgconfig:/tmp/build_root/m64/lib/x86_64-linux-gnu/pkgconfig:/tmp/build_root/m64/lib/pkgconfig:/usr/lib64/pkgconfig:/usr/lib/x86_64-linux-gnu/pkgconfig:/usr/lib/pkgconfig'
Run-time dependency wayland-egl-backend found: YES 3
Using 'PKG_CONFIG_PATH' from environment with value: '/tmp/build_root/m64/lib64/pkgconfig:/tmp/build_root/m64/lib/x86_64-linux-gnu/pkgconfig:/tmp/build_root/m64/lib/pkgconfig:/usr/lib64/pkgconfig:/usr/lib/x86_64-linux-gnu/pkgconfig:/usr/lib/pkgconfig'
Run-time dependency x11 found: YES 1.7.0
Using 'PKG_CONFIG_PATH' from environment with value: '/tmp/build_root/m64/lib64/pkgconfig:/tmp/build_root/m64/lib/x86_64-linux-gnu/pkgconfig:/tmp/build_root/m64/lib/pkgconfig:/usr/lib64/pkgconfig:/usr/lib/x86_64-linux-gnu/pkgconfig:/usr/lib/pkgconfig'
Run-time dependency xext found: YES 1.3.3
Using 'PKG_CONFIG_PATH' from environment with value: '/tmp/build_root/m64/lib64/pkgconfig:/tmp/build_root/m64/lib/x86_64-linux-gnu/pkgconfig:/tmp/build_root/m64/lib/pkgconfig:/usr/lib64/pkgconfig:/usr/lib/x86_64-linux-gnu/pkgconfig:/usr/lib/pkgconfig'
Run-time dependency xdamage found: YES 1.1.5
Using 'PKG_CONFIG_PATH' from environment with value: '/tmp/build_root/m64/lib64/pkgconfig:/tmp/build_root/m64/lib/x86_64-linux-gnu/pkgconfig:/tmp/build_root/m64/lib/pkgconfig:/usr/lib64/pkgconfig:/usr/lib/x86_64-linux-gnu/pkgconfig:/usr/lib/pkgconfig'
Run-time dependency xfixes found: YES 5.0.3
Using 'PKG_CONFIG_PATH' from environment with value: '/tmp/build_root/m64/lib64/pkgconfig:/tmp/build_root/m64/lib/x86_64-linux-gnu/pkgconfig:/tmp/build_root/m64/lib/pkgconfig:/usr/lib64/pkgconfig:/usr/lib/x86_64-linux-gnu/pkgconfig:/usr/lib/pkgconfig'
Run-time dependency xcb-glx found: YES 1.14
Using 'PKG_CONFIG_PATH' from environment with value: '/tmp/build_root/m64/lib64/pkgconfig:/tmp/build_root/m64/lib/x86_64-linux-gnu/pkgconfig:/tmp/build_root/m64/lib/pkgconfig:/usr/lib64/pkgconfig:/usr/lib/x86_64-linux-gnu/pkgconfig:/usr/lib/pkgconfig'
Run-time dependency xcb found: YES 1.14
Using 'PKG_CONFIG_PATH' from environment with value: '/tmp/build_root/m64/lib64/pkgconfig:/tmp/build_root/m64/lib/x86_64-linux-gnu/pkgconfig:/tmp/build_root/m64/lib/pkgconfig:/usr/lib64/pkgconfig:/usr/lib/x86_64-linux-gnu/pkgconfig:/usr/lib/pkgconfig'
Run-time dependency x11-xcb found: YES 1.7.0
Using 'PKG_CONFIG_PATH' from environment with value: '/tmp/build_root/m64/lib64/pkgconfig:/tmp/build_root/m64/lib/x86_64-linux-gnu/pkgconfig:/tmp/build_root/m64/lib/pkgconfig:/usr/lib64/pkgconfig:/usr/lib/x86_64-linux-gnu/pkgconfig:/usr/lib/pkgconfig'
Run-time dependency xcb-dri2 found: YES 1.14
Using 'PKG_CONFIG_PATH' from environment with value: '/tmp/build_root/m64/lib64/pkgconfig:/tmp/build_root/m64/lib/x86_64-linux-gnu/pkgconfig:/tmp/build_root/m64/lib/pkgconfig:/usr/lib64/pkgconfig:/usr/lib/x86_64-linux-gnu/pkgconfig:/usr/lib/pkgconfig'
Run-time dependency xcb-dri3 found: YES 1.14
Using 'PKG_CONFIG_PATH' from environment with value: '/tmp/build_root/m64/lib64/pkgconfig:/tmp/build_root/m64/lib/x86_64-linux-gnu/pkgconfig:/tmp/build_root/m64/lib/pkgconfig:/usr/lib64/pkgconfig:/usr/lib/x86_64-linux-gnu/pkgconfig:/usr/lib/pkgconfig'
Run-time dependency xcb-present found: YES 1.14
Using 'PKG_CONFIG_PATH' from environment with value: '/tmp/build_root/m64/lib64/pkgconfig:/tmp/build_root/m64/lib/x86_64-linux-gnu/pkgconfig:/tmp/build_root/m64/lib/pkgconfig:/usr/lib64/pkgconfig:/usr/lib/x86_64-linux-gnu/pkgconfig:/usr/lib/pkgconfig'
Run-time dependency xcb-sync found: YES 1.14
Using 'PKG_CONFIG_PATH' from environment with value: '/tmp/build_root/m64/lib64/pkgconfig:/tmp/build_root/m64/lib/x86_64-linux-gnu/pkgconfig:/tmp/build_root/m64/lib/pkgconfig:/usr/lib64/pkgconfig:/usr/lib/x86_64-linux-gnu/pkgconfig:/usr/lib/pkgconfig'
Run-time dependency xshmfence found: YES 1.3
Using 'PKG_CONFIG_PATH' from environment with value: '/tmp/build_root/m64/lib64/pkgconfig:/tmp/build_root/m64/lib/x86_64-linux-gnu/pkgconfig:/tmp/build_root/m64/lib/pkgconfig:/usr/lib64/pkgconfig:/usr/lib/x86_64-linux-gnu/pkgconfig:/usr/lib/pkgconfig'
Run-time dependency glproto found: YES 1.4.17
Using 'PKG_CONFIG_PATH' from environment with value: '/tmp/build_root/m64/lib64/pkgconfig:/tmp/build_root/m64/lib/x86_64-linux-gnu/pkgconfig:/tmp/build_root/m64/lib/pkgconfig:/usr/lib64/pkgconfig:/usr/lib/x86_64-linux-gnu/pkgconfig:/usr/lib/pkgconfig'
Run-time dependency dri2proto found: YES 2.8
Using 'PKG_CONFIG_PATH' from environment with value: '/tmp/build_root/m64/lib64/pkgconfig:/tmp/build_root/m64/lib/x86_64-linux-gnu/pkgconfig:/tmp/build_root/m64/lib/pkgconfig:/usr/lib64/pkgconfig:/usr/lib/x86_64-linux-gnu/pkgconfig:/usr/lib/pkgconfig'
Run-time dependency xxf86vm found: YES 1.1.4
Using 'PKG_CONFIG_PATH' from environment with value: '/tmp/build_root/m64/lib64/pkgconfig:/tmp/build_root/m64/lib/x86_64-linux-gnu/pkgconfig:/tmp/build_root/m64/lib/pkgconfig:/usr/lib64/pkgconfig:/usr/lib/x86_64-linux-gnu/pkgconfig:/usr/lib/pkgconfig'
Run-time dependency xcb-xfixes found: YES 1.14
Using 'PKG_CONFIG_PATH' from environment with value: '/tmp/build_root/m64/lib64/pkgconfig:/tmp/build_root/m64/lib/x86_64-linux-gnu/pkgconfig:/tmp/build_root/m64/lib/pkgconfig:/usr/lib64/pkgconfig:/usr/lib/x86_64-linux-gnu/pkgconfig:/usr/lib/pkgconfig'
Run-time dependency xcb-randr found: YES 1.14
Using 'PKG_CONFIG_PATH' from environment with value: '/tmp/build_root/m64/lib64/pkgconfig:/tmp/build_root/m64/lib/x86_64-linux-gnu/pkgconfig:/tmp/build_root/m64/lib/pkgconfig:/usr/lib64/pkgconfig:/usr/lib/x86_64-linux-gnu/pkgconfig:/usr/lib/pkgconfig'
Run-time dependency xrandr found: YES 1.5.1
Library sensors found: NO
Program nm found: YES (/usr/bin/nm)
Program symbols-check.py found: YES (/usr/bin/env python /home/jenkins/workspace/Leeroy_3/repos/mesa/bin/symbols-check.py)
Program install_megadrivers.py found: YES (/usr/bin/python3 /home/jenkins/workspace/Leeroy_3/repos/mesa/bin/install_megadrivers.py)
Program xmllint found: YES (/usr/bin/xmllint)
Has header "sys/time.h" : YES 
WARNING: Library target 'GLESv1_CM' has 'name_prefix' set. Compilers may not find it from its '-lGLESv1_CM' linker flag in the 'glesv1_cm.pc' pkg-config file.
WARNING: Library target 'GLESv1_CM' has 'name_prefix' set. Compilers may not find it from its '-lGLESv1_CM' linker flag in the 'glesv1_cm-uninstalled.pc' pkg-config file.
WARNING: Library target 'GLESv2' has 'name_prefix' set. Compilers may not find it from its '-lGLESv2' linker flag in the 'glesv2.pc' pkg-config file.
WARNING: Library target 'GLESv2' has 'name_prefix' set. Compilers may not find it from its '-lGLESv2' linker flag in the 'glesv2-uninstalled.pc' pkg-config file.
WARNING: Project targeting '>= 0.46' but tried to use feature introduced in '0.50.0': install arg in configure_file.
Configuring intel_sanitize_gpu using configuration
Configuring intel_dump_gpu using configuration
Using 'PKG_CONFIG_PATH' from environment with value: '/tmp/build_root/m64/lib64/pkgconfig:/tmp/build_root/m64/lib/x86_64-linux-gnu/pkgconfig:/tmp/build_root/m64/lib/pkgconfig:/usr/lib64/pkgconfig:/usr/lib/x86_64-linux-gnu/pkgconfig:/usr/lib/pkgconfig'
Run-time dependency epoxy found: YES 1.5.5
Using 'PKG_CONFIG_PATH' from environment with value: '/tmp/build_root/m64/lib64/pkgconfig:/tmp/build_root/m64/lib/x86_64-linux-gnu/pkgconfig:/tmp/build_root/m64/lib/pkgconfig:/usr/lib64/pkgconfig:/usr/lib/x86_64-linux-gnu/pkgconfig:/usr/lib/pkgconfig'
Run-time dependency gtk+-3.0 found: YES 3.24.24
Program tests/run-test.sh found: YES (/bin/sh /home/jenkins/workspace/Leeroy_3/repos/mesa/src/intel/tools/tests/run-test.sh)
src/intel/tools/meson.build:173: DEPRECATION: ":" is not allowed in test name "i965_asm : tests/gen4", it has been replaced with "_"
src/intel/tools/meson.build:173: DEPRECATION: ":" is not allowed in test name "i965_asm : tests/gen4.5", it has been replaced with "_"
src/intel/tools/meson.build:173: DEPRECATION: ":" is not allowed in test name "i965_asm : tests/gen5", it has been replaced with "_"
src/intel/tools/meson.build:173: DEPRECATION: ":" is not allowed in test name "i965_asm : tests/gen6", it has been replaced with "_"
src/intel/tools/meson.build:173: DEPRECATION: ":" is not allowed in test name "i965_asm : tests/gen7", it has been replaced with "_"
src/intel/tools/meson.build:173: DEPRECATION: ":" is not allowed in test name "i965_asm : tests/gen7.5", it has been replaced with "_"
src/intel/tools/meson.build:173: DEPRECATION: ":" is not allowed in test name "i965_asm : tests/gen8", it has been replaced with "_"
src/intel/tools/meson.build:173: DEPRECATION: ":" is not allowed in test name "i965_asm : tests/gen9", it has been replaced with "_"
src/intel/tools/meson.build:173: DEPRECATION: ":" is not allowed in test name "i965_asm : tests/gen11", it has been replaced with "_"
Program /home/jenkins/workspace/Leeroy_3/repos/mesa/bin/install_megadrivers.py found: YES (/usr/bin/python3 /home/jenkins/workspace/Leeroy_3/repos/mesa/bin/install_megadrivers.py)
Program dispatch-index-check found: YES (/home/jenkins/workspace/Leeroy_3/repos/mesa/src/glx/tests/dispatch-index-check)
Checking for function "mincore" : YES 
Compiler for C++ supports arguments -Wno-ignored-attributes: YES 
Library clangCodeGen found: YES
Library clangFrontendTool found: YES
Library clangFrontend found: YES
Library clangDriver found: YES
Library clangSerialization found: YES
Library clangParse found: YES
Library clangSema found: YES
Library clangAnalysis found: YES
Library clangAST found: YES
Library clangASTMatchers found: YES
Library clangEdit found: YES
Library clangLex found: YES
Library clangBasic found: YES
Program /home/jenkins/workspace/Leeroy_3/repos/mesa/bin/install_megadrivers.py found: YES (/usr/bin/python3 /home/jenkins/workspace/Leeroy_3/repos/mesa/bin/install_megadrivers.py)
Program /home/jenkins/workspace/Leeroy_3/repos/mesa/bin/install_megadrivers.py found: YES (/usr/bin/python3 /home/jenkins/workspace/Leeroy_3/repos/mesa/bin/install_megadrivers.py)
Using 'PKG_CONFIG_PATH' from environment with value: '/tmp/build_root/m64/lib64/pkgconfig:/tmp/build_root/m64/lib/x86_64-linux-gnu/pkgconfig:/tmp/build_root/m64/lib/pkgconfig:/usr/lib64/pkgconfig:/usr/lib/x86_64-linux-gnu/pkgconfig:/usr/lib/pkgconfig'
Run-time dependency xvmc-wrapper found: YES 1.0.12
Dependency xvmc found: YES 1.0.12 (cached)
Program /home/jenkins/workspace/Leeroy_3/repos/mesa/bin/install_megadrivers.py found: YES (/usr/bin/python3 /home/jenkins/workspace/Leeroy_3/repos/mesa/bin/install_megadrivers.py)
Program /home/jenkins/workspace/Leeroy_3/repos/mesa/bin/install_megadrivers.py found: YES (/usr/bin/python3 /home/jenkins/workspace/Leeroy_3/repos/mesa/bin/install_megadrivers.py)
Configuring xa_tracker.h using configuration
Message: Configuration summary:
        
        prefix:          /tmp/build_root/m64
        libdir:          lib
        includedir:      include
        
        OpenGL:          yes (ES1: yes ES2: yes)
        OSMesa:          no
        
        DRI platform:    drm
        DRI drivers:     i915 i965 r100 r200 nouveau
        DRI driver dir:  /tmp/build_root/m64/lib/dri
        
        GLX:             DRI-based
        
        EGL:             yes
        EGL drivers:     builtin:egl_dri2 builtin:egl_dri3
        GBM:             yes
        EGL/Vulkan/VL platforms:   x11 wayland drm surfaceless
        
        Vulkan drivers:  amd intel
        Vulkan ICD dir:  share/vulkan/icd.d
        
        llvm:            yes
        llvm-version:    11.0.1
        
        Gallium drivers: r300 r600 radeonsi nouveau virgl svga swrast iris
        Gallium st:      mesa xa xvmc xvmc vdpau omxbellagio va nine clover
        HUD lmsensors:   no
        
        Shared-glapi:    yes

Build targets in project: 372
WARNING: Project specifies a minimum meson_version '>= 0.46' but uses features which were added in newer versions:
 * 0.50.0: {'install arg in configure_file'}
 * 0.52.0: {'version arg in find_program'}

Found ninja-1.10.1 at /usr/bin/ninja
 meson configure /home/jenkins/workspace/Leeroy_3/repos/mesa/build_mesa-buildtest_m64
Core properties:
  Source dir /home/jenkins/workspace/Leeroy_3/repos/mesa
  Build dir  /home/jenkins/workspace/Leeroy_3/repos/mesa/build_mesa-buildtest_m64
                                                                                                                                                                                                                                                                                                    
Main project options:                                                                                                                                                                                                                                                                               
                                                                                                                                                                                                                                                                                                    
  Core options            Current Value                                                                                                                                                                                               Possible Values                                               Description
  ------------            -------------                                                                                                                                                                                               ---------------                                               -----------
  auto_features           auto                                                                                                                                                                                                        [enabled, disabled, auto]                                     Override value of all 'auto' features
  backend                 ninja                                                                                                                                                                                                       [ninja, vs, vs2010, vs2015, vs2017, vs2019, xcode]            Backend to use
  buildtype               debugoptimized                                                                                                                                                                                              [plain, debug, debugoptimized, release, minsize, custom]      Build type to use
  debug                   true                                                                                                                                                                                                        [true, false]                                                 Debug
  default_library         shared                                                                                                                                                                                                      [shared, static, both]                                        Default library type
  force_fallback_for      []                                                                                                                                                                                                                                                                        Force fallback for those subprojects
  install_umask           0022                                                                                                                                                                                                        [preserve, 0000-0777]                                         Default umask to apply on permissions of installed files
  layout                  mirror                                                                                                                                                                                                      [mirror, flat]                                                Build directory layout
  optimization            2                                                                                                                                                                                                           [0, g, 1, 2, 3, s]                                            Optimization level
  strip                   false                                                                                                                                                                                                       [true, false]                                                 Strip targets on install
  unity                   off                                                                                                                                                                                                         [on, off, subprojects]                                        Unity build
  unity_size              4                                                                                                                                                                                                           >=2                                                           Unity block size
  warning_level           1                                                                                                                                                                                                           [0, 1, 2, 3]                                                  Compiler warning level to use
  werror                  false                                                                                                                                                                                                       [true, false]                                                 Treat warnings as errors
  wrap_mode               default                                                                                                                                                                                                     [default, nofallback, nodownload, forcefallback]              Wrap mode
  cmake_prefix_path       []                                                                                                                                                                                                                                                                        List of additional prefixes for cmake to search
  pkg_config_path         [/tmp/build_root/m64/lib64/pkgconfig, /tmp/build_root/m64/lib/x86_64-linux-gnu/pkgconfig, /tmp/build_root/m64/lib/pkgconfig, /usr/lib64/pkgconfig, /usr/lib/x86_64-linux-gnu/pkgconfig, /usr/lib/pkgconfig]                                                               List of additional paths for pkg-config to search
                                                                                                                                                                                                                                                                                                    
  Backend options         Current Value                                                                                                                                                                                               Possible Values                                               Description
  ---------------         -------------                                                                                                                                                                                               ---------------                                               -----------
  backend_max_links       0                                                                                                                                                                                                           >=0                                                           Maximum number of linker processes to run or 0 for no limit
                                                                                                                                                                                                                                                                                                    
  Base options            Current Value                                                                                                                                                                                               Possible Values                                               Description
  ------------            -------------                                                                                                                                                                                               ---------------                                               -----------
  b_asneeded              true                                                                                                                                                                                                        [true, false]                                                 Use -Wl,--as-needed when linking
  b_colorout              always                                                                                                                                                                                                      [auto, always, never]                                         Use colored output
  b_coverage              false                                                                                                                                                                                                       [true, false]                                                 Enable coverage tracking.
  b_lto                   false                                                                                                                                                                                                       [true, false]                                                 Use link time optimization
  b_lundef                true                                                                                                                                                                                                        [true, false]                                                 Use -Wl,--no-undefined when linking
  b_ndebug                if-release                                                                                                                                                                                                  [true, false, if-release]                                     Disable asserts
  b_pch                   true                                                                                                                                                                                                        [true, false]                                                 Use precompiled headers
  b_pgo                   off                                                                                                                                                                                                         [off, generate, use]                                          Use profile guided optimization
  b_pie                   false                                                                                                                                                                                                       [true, false]                                                 Build executables as position independent
  b_sanitize              none                                                                                                                                                                                                        [none, address, thread, undefined, memory, address,undefined] Code sanitizer to use
  b_staticpic             true                                                                                                                                                                                                        [true, false]                                                 Build static libraries as position independent
                                                                                                                                                                                                                                                                                                    
  Compiler options        Current Value                                                                                                                                                                                               Possible Values                                               Description
  ----------------        -------------                                                                                                                                                                                               ---------------                                               -----------
  c_args                  []                                                                                                                                                                                                                                                                        Extra arguments passed to the c compiler
  c_link_args             []                                                                                                                                                                                                                                                                        Extra arguments passed to the c linker
  c_std                   c99                                                                                                                                                                                                         [none, c89, c99, c11, c17, c18, c2x, gnu89, gnu99, gnu11,     C language standard to use
                                                                                                                                                                                                                                       gnu17, gnu18, gnu2x]                                         
  cpp_args                []                                                                                                                                                                                                                                                                        Extra arguments passed to the cpp compiler
  cpp_debugstl            false                                                                                                                                                                                                       [true, false]                                                 STL debug mode
  cpp_eh                  default                                                                                                                                                                                                     [none, default, a, s, sc]                                     C++ exception handling type.
  cpp_link_args           []                                                                                                                                                                                                                                                                        Extra arguments passed to the cpp linker
  cpp_rtti                true                                                                                                                                                                                                        [true, false]                                                 Enable RTTI
  cpp_std                 c++14                                                                                                                                                                                                       [none, c++98, c++03, c++11, c++14, c++17, c++1z, c++2a,       C++ language standard to use
                                                                                                                                                                                                                                       gnu++03, gnu++11, gnu++14, gnu++17, gnu++1z, gnu++2a]        
                                                                                                                                                                                                                                                                                                    
  Directories             Current Value                                                                                                                                                                                               Possible Values                                               Description
  -----------             -------------                                                                                                                                                                                               ---------------                                               -----------
  bindir                  bin                                                                                                                                                                                                                                                                       Executable directory
  datadir                 share                                                                                                                                                                                                                                                                     Data file directory
  includedir              include                                                                                                                                                                                                                                                                   Header file directory
  infodir                 share/info                                                                                                                                                                                                                                                                Info page directory
  libdir                  lib                                                                                                                                                                                                                                                                       Library directory
  libexecdir              libexec                                                                                                                                                                                                                                                                   Library executable directory
  localedir               share/locale                                                                                                                                                                                                                                                              Locale data directory
  localstatedir           var                                                                                                                                                                                                                                                                       Localstate data directory
  mandir                  share/man                                                                                                                                                                                                                                                                 Manual page directory
  prefix                  /tmp/build_root/m64                                                                                                                                                                                                                                                       Installation prefix
  sbindir                 sbin                                                                                                                                                                                                                                                                      System executable directory
  sharedstatedir          com                                                                                                                                                                                                                                                                       Architecture-independent data directory
  sysconfdir              etc                                                                                                                                                                                                                                                                       Sysconf data directory
                                                                                                                                                                                                                                                                                                    
  Testing options         Current Value                                                                                                                                                                                               Possible Values                                               Description
  ---------------         -------------                                                                                                                                                                                               ---------------                                               -----------
  errorlogs               true                                                                                                                                                                                                        [true, false]                                                 Whether to print the logs from failing tests
  stdsplit                true                                                                                                                                                                                                        [true, false]                                                 Split stdout and stderr in test logs
                                                                                                                                                                                                                                                                                                    
  Project options         Current Value                                                                                                                                                                                               Possible Values                                               Description
  ---------------         -------------                                                                                                                                                                                               ---------------                                               -----------
  build-tests             true                                                                                                                                                                                                        [true, false]                                                 Build unit tests. Currently this will build *all* unit tests, which may build more than expected.
  d3d-drivers-path                                                                                                                                                                                                                                                                                  Location of D3D drivers. Default: $libdir/d3d
  dri-drivers             [auto]                                                                                                                                                                                                      [auto, i915, i965, r100, r200, nouveau, swrast]               List of dri drivers to build. If this is set to auto all drivers applicable to the target OS/architecture will be built
  dri-drivers-path                                                                                                                                                                                                                                                                                  Location to install dri drivers. Default: $libdir/dri.
  dri-search-path                                                                                                                                                                                                                                                                                   Locations to search for dri drivers, passed as colon separated list. Default: dri-drivers-path.
  dri3                    auto                                                                                                                                                                                                        [auto, true, false]                                           enable support for dri3
  egl                     auto                                                                                                                                                                                                        [auto, true, false]                                           Build support for EGL platform
  egl-lib-suffix                                                                                                                                                                                                                                                                                    Suffix to append to EGL library name.  Default: none.
  gallium-drivers         [, lima, radeonsi, virgl, kmsro, auto, v3d, etnaviv, iris, nouveau, tegra, r600, swr, freedreno, vc4, panfrost, r300, svga, swrast, zink]                                                                   [auto, kmsro, radeonsi, r300, r600, nouveau, freedreno,       List of gallium drivers to build. If this is set to auto all drivers applicable to the target OS/architecture will be built
                                                                                                                                                                                                                                       swrast, v3d, vc4, etnaviv, tegra, i915, svga, virgl, swr,    
                                                                                                                                                                                                                                       panfrost, iris, lima, zink]                                  
  gallium-extra-hud       false                                                                                                                                                                                                       [true, false]                                                 Enable HUD block/NIC I/O HUD status support
  gallium-nine            true                                                                                                                                                                                                        [true, false]                                                 build gallium "nine" Direct3D 9.x state tracker.
  gallium-omx             bellagio                                                                                                                                                                                                    [auto, disabled, bellagio, tizonia]                           enable gallium omx state tracker.
  gallium-opencl          standalone                                                                                                                                                                                                  [icd, standalone, disabled]                                   build gallium "clover" OpenCL state tracker.
  gallium-va              true                                                                                                                                                                                                        [auto, true, false]                                           enable gallium va state tracker.
  gallium-vdpau           true                                                                                                                                                                                                        [auto, true, false]                                           enable gallium vdpau state tracker.
  gallium-xa              true                                                                                                                                                                                                        [auto, true, false]                                           enable gallium xa state tracker.
  gallium-xvmc            true                                                                                                                                                                                                        [auto, true, false]                                           enable gallium xvmc state tracker.
  gbm                     auto                                                                                                                                                                                                        [auto, true, false]                                           Build support for gbm platform
  gles-lib-suffix                                                                                                                                                                                                                                                                                   Suffix to append to GLES library names.  Default: none.
  gles1                   auto                                                                                                                                                                                                        [auto, true, false]                                           Build support for OpenGL ES 1.x
  gles2                   auto                                                                                                                                                                                                        [auto, true, false]                                           Build support for OpenGL ES 2.x and 3.x
  glvnd                   false                                                                                                                                                                                                       [true, false]                                                 Enable GLVND support.
  glx                     auto                                                                                                                                                                                                        [auto, disabled, dri, xlib, gallium-xlib]                     Build support for GLX platform
  glx-direct              true                                                                                                                                                                                                        [true, false]                                                 Enable direct rendering in GLX and EGL for DRI
  glx-read-only-text      false                                                                                                                                                                                                       [true, false]                                                 Disable writable .text section on x86 (decreases performance)
  install-intel-gpu-tests false                                                                                                                                                                                                       [true, false]                                                 Build and install Intel unit tests which require the GPU.  This option is for developers and the Intel CI system only.
  libunwind               auto                                                                                                                                                                                                        [auto, true, false]                                           Use libunwind for stack-traces
  llvm                    auto                                                                                                                                                                                                        [auto, true, false]                                           Build with LLVM support.
  lmsensors               auto                                                                                                                                                                                                        [auto, true, false]                                           Enable HUD lmsensors support.
  omx-libs-path                                                                                                                                                                                                                                                                                     path to put omx libraries. defaults to omx-bellagio pkg-config pluginsdir.
  opencl-spirv            false                                                                                                                                                                                                       [true, false]                                                 build gallium "clover" OpenCL state tracker with SPIR-V binary support.
  opengl                  true                                                                                                                                                                                                        [true, false]                                                 Build support for OpenGL (all versions)
  osmesa                  none                                                                                                                                                                                                        [none, classic, gallium]                                      Build OSmesa.
  osmesa-bits             8                                                                                                                                                                                                           [8, 16, 32]                                                   Number of channel bits for OSMesa.
  platform-sdk-version    25                                                                                                                                                                                                          >=25, <=28                                                    Android Platform SDK version. Default: Nougat version.
  platforms               [auto]                                                                                                                                                                                                      [auto, x11, wayland, drm, surfaceless, haiku, android,        window systems to support. If this is set to `auto`, all platforms applicable will be enabled.
                                                                                                                                                                                                                                       windows]                                                     
  power8                  auto                                                                                                                                                                                                        [auto, true, false]                                           Enable power8 optimizations.
  prefer-iris             true                                                                                                                                                                                                        [true, false]                                                 Prefer new Intel iris driver over older i965 driver
  selinux                 false                                                                                                                                                                                                       [true, false]                                                 Build an SELinux-aware Mesa
  shader-cache            auto                                                                                                                                                                                                        [auto, true, false]                                           Build with on-disk shader cache support
  shared-glapi            auto                                                                                                                                                                                                        [auto, true, false]                                           Whether to build a shared or static glapi. Defaults to false on Windows, true elsewhere
  shared-llvm             true                                                                                                                                                                                                        [true, false]                                                 Whether to link llvm shared or statically.
  shared-swr              true                                                                                                                                                                                                        [true, false]                                                 Whether to link SWR shared or statically.
  swr-arches              [avx, avx2]                                                                                                                                                                                                 [avx, avx2, knl, skx]                                         Architectures to build SWR support for.
  tools                   [all]                                                                                                                                                                                                       [drm-shim, etnaviv, freedreno, glsl, intel, intel-ui, nir,    List of tools to build. (Note: `intel-ui` selects `intel`)
                                                                                                                                                                                                                                       nouveau, xvmc, lima, all]                                    
  va-libs-path                                                                                                                                                                                                                                                                                      path to put va libraries. defaults to $libdir/dri.
  valgrind                auto                                                                                                                                                                                                        [auto, true, false]                                           Build with valgrind support
  vdpau-libs-path                                                                                                                                                                                                                                                                                   path to put vdpau libraries. defaults to $libdir/vdpau.
  vulkan-drivers          [auto]                                                                                                                                                                                                      [auto, amd, freedreno, intel]                                 List of vulkan drivers to build. If this is set to auto all drivers applicable to the target OS/architecture will be built
  vulkan-icd-dir                                                                                                                                                                                                                                                                                    Location relative to prefix to put vulkan icds on install. Default: $datadir/vulkan/icd.d
  vulkan-overlay-layer    false                                                                                                                                                                                                       [true, false]                                                 Whether to build the vulkan overlay layer
  xlib-lease              auto                                                                                                                                                                                                        [auto, true, false]                                           Enable VK_EXT_acquire_xlib_display.
  xvmc-libs-path                                                                                                                                                                                                                                                                                    path to put xvmc libraries. defaults to $libdir.
  zstd                    auto                                                                                                                                                                                                        [auto, true, false]                                           Use ZSTD instead of ZLIB in some cases.
 ninja -j 18 -C /home/jenkins/workspace/Leeroy_3/repos/mesa/build_mesa-buildtest_m64
ninja: Entering directory `/home/jenkins/workspace/Leeroy_3/repos/mesa/build_mesa-buildtest_m64'
[1/2702] Generating xmlpool_options.h with a custom command
Warning: language 'ca' not found.
Warning: language 'es' not found.
Warning: language 'de' not found.
Warning: language 'nl' not found.
Warning: language 'sv' not found.
Warning: language 'fr' not found.
[2/2702] Generating git_sha1.h with a custom command
[3/2702] Compiling C object src/libglsl_util.a.p/mesa_program_dummy_errors.c.o
[4/2702] Compiling C object src/util/format/libmesa_format.a.p/u_format_etc.c.o
[5/2702] Compiling C object src/util/libmesa_util.a.p/rand_xor.c.o
[6/2702] Compiling C object src/util/format/libmesa_format.a.p/u_format_tests.c.o
[7/2702] Compiling C object src/util/libmesa_util.a.p/u_process.c.o
[8/2702] Compiling C object src/util/libmesa_util.a.p/os_time.c.o
[9/2702] Compiling C object src/libglsl_util.a.p/mesa_program_symbol_table.c.o
[10/2702] Compiling C object src/libglsl_util.a.p/mesa_program_prog_parameter.c.o
[11/2702] Compiling C object src/util/format/libmesa_format.a.p/u_format_latc.c.o
[12/2702] Compiling C object src/util/libmesa_util.a.p/anon_file.c.o
[13/2702] Compiling C object src/util/libmesa_util.a.p/bitscan.c.o
[14/2702] Compiling C object src/libglsl_util.a.p/mesa_main_extensions_table.c.o
[15/2702] Linking static target src/libglsl_util.a
[16/2702] Compiling C object src/util/libmesa_util.a.p/os_file.c.o
[17/2702] Compiling C object src/util/libmesa_util.a.p/crc32.c.o
[18/2702] Compiling C object src/util/libmesa_util.a.p/build_id.c.o
[19/2702] Compiling C object src/util/libmesa_util.a.p/double.c.o
[20/2702] Compiling C object src/util/libmesa_util.a.p/dag.c.o
[21/2702] Compiling C object src/util/libmesa_util.a.p/debug.c.o
[22/2702] Compiling C object src/util/format/libmesa_format.a.p/u_format_rgtc.c.o
[23/2702] Compiling C object src/util/format/libmesa_format.a.p/u_format_other.c.o
[24/2702] Compiling C object src/util/format/libmesa_format.a.p/u_format.c.o
[25/2702] Compiling C object src/util/libmesa_util.a.p/ralloc.c.o
[26/2702] Compiling C object src/util/format/libmesa_format.a.p/u_format_zs.c.o
[27/2702] Compiling C object src/util/libmesa_util.a.p/fast_idiv_by_const.c.o
[28/2702] Compiling C object src/util/libmesa_util.a.p/mesa-sha1.c.o
[29/2702] Compiling C object src/util/libmesa_util.a.p/blob.c.o
[30/2702] Compiling C object src/util/libmesa_util.a.p/os_misc.c.o
[31/2702] Compiling C object src/util/libmesa_util.a.p/strtod.c.o
[32/2702] Compiling C object src/util/libmesa_util.a.p/imports.c.o
[33/2702] Compiling C object src/util/libmesa_util.a.p/os_socket.c.o
[34/2702] Compiling C object src/util/libmesa_util.a.p/half_float.c.o
[35/2702] Compiling C object src/util/libmesa_util.a.p/string_buffer.c.o
[36/2702] Compiling C object src/util/libmesa_util.a.p/disk_cache.c.o
[37/2702] Compiling C object src/util/format/libmesa_format.a.p/u_format_yuv.c.o
[38/2702] Generating u_format_table.c with a custom command (wrapped by meson to capture output)
[39/2702] Compiling C object src/util/libmesa_util.a.p/u_atomic.c.o
[40/2702] Compiling C object src/util/libmesa_util.a.p/slab.c.o
[41/2702] Compiling C object src/util/libmesa_util.a.p/u_vector.c.o
[42/2702] Compiling C object src/util/libmesa_util.a.p/rb_tree.c.o
[43/2702] Compiling C object src/util/libmesa_util.a.p/hash_table.c.o
[44/2702] Compiling C object src/util/libmesa_util.a.p/sha1_sha1.c.o
[45/2702] Compiling C object src/util/libmesa_util.a.p/set.c.o
[46/2702] Compiling C object src/util/libmesa_util.a.p/sparse_array.c.o
[47/2702] Compiling C object src/util/libmesa_util.a.p/u_mm.c.o
[48/2702] Compiling C object src/util/libmesa_util.a.p/u_math.c.o
[49/2702] Compiling C object src/util/mesa-sha1_test.p/mesa-sha1_test.c.o
[50/2702] Compiling C object src/util/libmesa_util.a.p/u_debug_memory.c.o
[51/2702] Compiling C object src/util/libmesa_util.a.p/u_cpu_detect.c.o
[52/2702] Compiling C object src/util/libmesa_util.a.p/u_queue.c.o
[53/2702] Compiling C object src/util/libmesa_util.a.p/u_debug.c.o
[54/2702] Compiling C object src/util/format/libmesa_format.a.p/u_format_bptc.c.o
[55/2702] Compiling C object src/util/libmesa_util.a.p/vma.c.o
[56/2702] Compiling C object src/util/blob_test.p/blob_test.c.o
[57/2702] Compiling C object src/util/u_atomic_test.p/u_atomic_test.c.o
[58/2702] Compiling C object src/util/roundeven_test.p/roundeven_test.c.o
[59/2702] Compiling C object src/util/libmesa_util.a.p/register_allocate.c.o
[60/2702] Compiling C object src/util/process_test.p/process_test.c.o
[61/2702] Compiling C object src/util/tests/hash_table/delete_and_lookup_test.p/delete_and_lookup.c.o
[62/2702] Compiling C object src/util/rb_tree_test.p/rb_tree_test.c.o
[63/2702] Compiling C object src/util/libmesa_util.a.p/softfloat.c.o
[64/2702] Linking target src/util/roundeven_test
[65/2702] Compiling C++ object src/gtest/libgtest.a.p/src_gtest_main.cc.o
[66/2702] Compiling C object src/util/libmesa_util.a.p/rgtc.c.o
[67/2702] Compiling C object src/util/tests/hash_table/insert_and_lookup_test.p/insert_and_lookup.c.o
[68/2702] Compiling C object src/util/tests/hash_table/collision_test.p/collision.c.o
[69/2702] Compiling C object src/util/tests/hash_table/delete_management_test.p/delete_management.c.o
[70/2702] Compiling C object src/util/tests/hash_table/destroy_callback_test.p/destroy_callback.c.o
[71/2702] Compiling C object src/util/tests/hash_table/null_destroy_test.p/null_destroy.c.o
[72/2702] Compiling C object src/util/tests/hash_table/replacement_test.p/replacement.c.o
[73/2702] Compiling C object src/util/tests/hash_table/remove_null_test.p/remove_null.c.o
[74/2702] Compiling C object src/util/tests/hash_table/clear_test.p/clear.c.o
[75/2702] Compiling C object src/util/tests/hash_table/insert_many_test.p/insert_many.c.o
[76/2702] Compiling C object src/util/tests/hash_table/random_entry_test.p/random_entry.c.o
[77/2702] Compiling C object src/util/tests/hash_table/remove_key_test.p/remove_key.c.o
[78/2702] Compiling C object src/util/tests/format/srgb.p/srgb.c.o
[79/2702] Compiling C object src/util/tests/format/u_format_compatible_test.p/u_format_compatible_test.c.o
[80/2702] Compiling C object src/util/tests/sparse_array/multi_threaded.p/multi_threaded.c.o
[81/2702] Compiling C object src/util/libxmlconfig.a.p/xmlconfig.c.o
[82/2702] Linking static target src/util/libxmlconfig.a
[83/2702] Compiling C object src/util/format/libmesa_format.a.p/u_format_s3tc.c.o
[84/2702] Compiling C object src/util/tests/format/u_format_test.p/u_format_test.c.o
[85/2702] Generating indirect.h with a custom command (wrapped by meson to capture output)
FAILED: src/mapi/glapi/gen/indirect.h 
/usr/bin/meson --internal exe --capture src/mapi/glapi/gen/indirect.h -- /usr/bin/python3 ../src/mapi/glapi/gen/glX_proto_send.py -f ../src/mapi/glapi/gen/gl_API.xml -m init_h
Traceback (most recent call last):
  File "/home/jenkins/workspace/Leeroy_3/repos/mesa/build_mesa-buildtest_m64/../src/mapi/glapi/gen/glX_proto_send.py", line 1159, in <module>
    main()
  File "/home/jenkins/workspace/Leeroy_3/repos/mesa/build_mesa-buildtest_m64/../src/mapi/glapi/gen/glX_proto_send.py", line 1153, in main
    api = gl_XML.parse_GL_API(args.filename, glX_XML.glx_item_factory())
  File "/home/jenkins/workspace/Leeroy_3/repos/mesa/src/mapi/glapi/gen/gl_XML.py", line 44, in parse_GL_API
    api.parse_file( file_name )
  File "/home/jenkins/workspace/Leeroy_3/repos/mesa/src/mapi/glapi/gen/gl_XML.py", line 868, in parse_file
    self.process_element(file_name, doc)
  File "/home/jenkins/workspace/Leeroy_3/repos/mesa/src/mapi/glapi/gen/gl_XML.py", line 874, in process_element
    self.process_OpenGLAPI(file_name, element)
  File "/home/jenkins/workspace/Leeroy_3/repos/mesa/src/mapi/glapi/gen/gl_XML.py", line 879, in process_OpenGLAPI
    for child in element.getchildren():
AttributeError: 'xml.etree.ElementTree.Element' object has no attribute 'getchildren'
[86/2702] Generating marshal_generated7.c with a custom command (wrapped by meson to capture output)
FAILED: src/mapi/glapi/gen/marshal_generated7.c 
/usr/bin/meson --internal exe --capture src/mapi/glapi/gen/marshal_generated7.c -- /usr/bin/python3 ../src/mapi/glapi/gen/gl_marshal.py -f ../src/mapi/glapi/gen/gl_and_es_API.xml -i 7 -n 8
Traceback (most recent call last):
  File "/home/jenkins/workspace/Leeroy_3/repos/mesa/build_mesa-buildtest_m64/../src/mapi/glapi/gen/gl_marshal.py", line 376, in <module>
    api = gl_XML.parse_GL_API(file_name, marshal_XML.marshal_item_factory())
  File "/home/jenkins/workspace/Leeroy_3/repos/mesa/src/mapi/glapi/gen/gl_XML.py", line 44, in parse_GL_API
    api.parse_file( file_name )
  File "/home/jenkins/workspace/Leeroy_3/repos/mesa/src/mapi/glapi/gen/gl_XML.py", line 868, in parse_file
    self.process_element(file_name, doc)
  File "/home/jenkins/workspace/Leeroy_3/repos/mesa/src/mapi/glapi/gen/gl_XML.py", line 874, in process_element
    self.process_OpenGLAPI(file_name, element)
  File "/home/jenkins/workspace/Leeroy_3/repos/mesa/src/mapi/glapi/gen/gl_XML.py", line 879, in process_OpenGLAPI
    for child in element.getchildren():
AttributeError: 'xml.etree.ElementTree.Element' object has no attribute 'getchildren'
[87/2702] Generating indirect.c with a custom command (wrapped by meson to capture output)
FAILED: src/mapi/glapi/gen/indirect.c 
/usr/bin/meson --internal exe --capture src/mapi/glapi/gen/indirect.c -- /usr/bin/python3 ../src/mapi/glapi/gen/glX_proto_send.py -f ../src/mapi/glapi/gen/gl_API.xml -m proto
Traceback (most recent call last):
  File "/home/jenkins/workspace/Leeroy_3/repos/mesa/build_mesa-buildtest_m64/../src/mapi/glapi/gen/glX_proto_send.py", line 1159, in <module>
    main()
  File "/home/jenkins/workspace/Leeroy_3/repos/mesa/build_mesa-buildtest_m64/../src/mapi/glapi/gen/glX_proto_send.py", line 1153, in main
    api = gl_XML.parse_GL_API(args.filename, glX_XML.glx_item_factory())
  File "/home/jenkins/workspace/Leeroy_3/repos/mesa/src/mapi/glapi/gen/gl_XML.py", line 44, in parse_GL_API
    api.parse_file( file_name )
  File "/home/jenkins/workspace/Leeroy_3/repos/mesa/src/mapi/glapi/gen/gl_XML.py", line 868, in parse_file
    self.process_element(file_name, doc)
  File "/home/jenkins/workspace/Leeroy_3/repos/mesa/src/mapi/glapi/gen/gl_XML.py", line 874, in process_element
    self.process_OpenGLAPI(file_name, element)
  File "/home/jenkins/workspace/Leeroy_3/repos/mesa/src/mapi/glapi/gen/gl_XML.py", line 879, in process_OpenGLAPI
    for child in element.getchildren():
AttributeError: 'xml.etree.ElementTree.Element' object has no attribute 'getchildren'
[88/2702] Compiling C++ object src/util/tests/fast_urem_by_const/fast_urem_by_const_test.p/fast_urem_by_const_test.cpp.o
[89/2702] Generating es1_glapi_mapi_tmp.h with a custom command (wrapped by meson to capture output)
[90/2702] Generating glapitable.h with a custom command (wrapped by meson to capture output)
FAILED: src/mapi/glapi/gen/glapitable.h 
/usr/bin/meson --internal exe --capture src/mapi/glapi/gen/glapitable.h -- /usr/bin/python3 ../src/mapi/glapi/gen/gl_table.py -f ../src/mapi/glapi/gen/gl_and_es_API.xml
Traceback (most recent call last):
  File "/home/jenkins/workspace/Leeroy_3/repos/mesa/build_mesa-buildtest_m64/../src/mapi/glapi/gen/gl_table.py", line 209, in <module>
    main()
  File "/home/jenkins/workspace/Leeroy_3/repos/mesa/build_mesa-buildtest_m64/../src/mapi/glapi/gen/gl_table.py", line 198, in main
    api = gl_XML.parse_GL_API(args.file_name)
  File "/home/jenkins/workspace/Leeroy_3/repos/mesa/src/mapi/glapi/gen/gl_XML.py", line 44, in parse_GL_API
    api.parse_file( file_name )
  File "/home/jenkins/workspace/Leeroy_3/repos/mesa/src/mapi/glapi/gen/gl_XML.py", line 868, in parse_file
    self.process_element(file_name, doc)
  File "/home/jenkins/workspace/Leeroy_3/repos/mesa/src/mapi/glapi/gen/gl_XML.py", line 874, in process_element
    self.process_OpenGLAPI(file_name, element)
  File "/home/jenkins/workspace/Leeroy_3/repos/mesa/src/mapi/glapi/gen/gl_XML.py", line 879, in process_OpenGLAPI
    for child in element.getchildren():
AttributeError: 'xml.etree.ElementTree.Element' object has no attribute 'getchildren'
[91/2702] Compiling C++ object src/util/tests/vma/vma_random_test.p/vma_random_test.cpp.o
[92/2702] Compiling C++ object src/util/tests/string_buffer/string_buffer_test.p/string_buffer_test.cpp.o
[93/2702] Generating marshal_generated0.c with a custom command (wrapped by meson to capture output)
FAILED: src/mapi/glapi/gen/marshal_generated0.c 
/usr/bin/meson --internal exe --capture src/mapi/glapi/gen/marshal_generated0.c -- /usr/bin/python3 ../src/mapi/glapi/gen/gl_marshal.py -f ../src/mapi/glapi/gen/gl_and_es_API.xml -i 0 -n 8
Traceback (most recent call last):
  File "/home/jenkins/workspace/Leeroy_3/repos/mesa/build_mesa-buildtest_m64/../src/mapi/glapi/gen/gl_marshal.py", line 376, in <module>
    api = gl_XML.parse_GL_API(file_name, marshal_XML.marshal_item_factory())
  File "/home/jenkins/workspace/Leeroy_3/repos/mesa/src/mapi/glapi/gen/gl_XML.py", line 44, in parse_GL_API
    api.parse_file( file_name )
  File "/home/jenkins/workspace/Leeroy_3/repos/mesa/src/mapi/glapi/gen/gl_XML.py", line 868, in parse_file
    self.process_element(file_name, doc)
  File "/home/jenkins/workspace/Leeroy_3/repos/mesa/src/mapi/glapi/gen/gl_XML.py", line 874, in process_element
    self.process_OpenGLAPI(file_name, element)
  File "/home/jenkins/workspace/Leeroy_3/repos/mesa/src/mapi/glapi/gen/gl_XML.py", line 879, in process_OpenGLAPI
    for child in element.getchildren():
AttributeError: 'xml.etree.ElementTree.Element' object has no attribute 'getchildren'
[94/2702] Generating glapi_mapi_tmp.h with a custom command (wrapped by meson to capture output)
FAILED: src/mapi/glapi/gen/glapi_mapi_tmp.h 
/usr/bin/meson --internal exe --capture src/mapi/glapi/gen/glapi_mapi_tmp.h -- /usr/bin/python3 ../src/mapi/mapi_abi.py --printer glapi ../src/mapi/glapi/gen/gl_and_es_API.xml
Traceback (most recent call last):
  File "/home/jenkins/workspace/Leeroy_3/repos/mesa/build_mesa-buildtest_m64/../src/mapi/mapi_abi.py", line 674, in <module>
    main()
  File "/home/jenkins/workspace/Leeroy_3/repos/mesa/build_mesa-buildtest_m64/../src/mapi/mapi_abi.py", line 667, in main
    entries = abi_parse_xml(filename)
  File "/home/jenkins/workspace/Leeroy_3/repos/mesa/build_mesa-buildtest_m64/../src/mapi/mapi_abi.py", line 140, in abi_parse_xml
    api = gl_XML.parse_GL_API(xml, glX_XML.glx_item_factory())
  File "/home/jenkins/workspace/Leeroy_3/repos/mesa/build_mesa-buildtest_m64/../src/mapi/glapi/gen/gl_XML.py", line 44, in parse_GL_API
    api.parse_file( file_name )
  File "/home/jenkins/workspace/Leeroy_3/repos/mesa/build_mesa-buildtest_m64/../src/mapi/glapi/gen/gl_XML.py", line 868, in parse_file
    self.process_element(file_name, doc)
  File "/home/jenkins/workspace/Leeroy_3/repos/mesa/build_mesa-buildtest_m64/../src/mapi/glapi/gen/gl_XML.py", line 874, in process_element
    self.process_OpenGLAPI(file_name, element)
  File "/home/jenkins/workspace/Leeroy_3/repos/mesa/build_mesa-buildtest_m64/../src/mapi/glapi/gen/gl_XML.py", line 879, in process_OpenGLAPI
    for child in element.getchildren():
AttributeError: 'xml.etree.ElementTree.Element' object has no attribute 'getchildren'
[95/2702] Compiling C++ object src/util/tests/vector/vector_test.p/vector_test.cpp.o
[96/2702] Compiling C++ object src/util/tests/set/set_test.p/set_test.cpp.o
[97/2702] Compiling C++ object src/util/bitset_test.p/bitset_test.cpp.o
[98/2702] Compiling C++ object src/util/tests/fast_idiv_by_const/fast_idiv_by_const_test.p/fast_idiv_by_const_test.cpp.o
[99/2702] Generating format_srgb with a custom command (wrapped by meson to capture output)
[100/2702] Compiling C++ object src/util/tests/timespec/timespec_test.p/timespec_test.cpp.o
[101/2702] Compiling C++ object src/gtest/libgtest.a.p/src_gtest-all.cc.o
[102/2702] Compiling C object src/util/format/libmesa_format.a.p/meson-generated_.._u_format_table.c.o
ninja: build stopped: subcommand failed.
ERROR: command failed
ERROR: creating a failing test: mesa-meson-buildtest : Command '['ninja', '-j', '18', '-C', '/home/jenkins/workspace/Leeroy_3/repos/mesa/build_mesa-buildtest_m64']' returned non-zero exit status 1.
 rsync -rlpD --exclude='*.o' --exclude='*.a' /tmp/build_root/test otc-mesa-ci.local::nfs/results/itoral/ed3069e6f1beb54ebee124afd11529b5/percheckin
 cp -a /tmp/build_root/m64/../test /home/jenkins/workspace/Leeroy_3
+ exit 0
Set build name.
New build name is 'mesa-buildtest-itoral-m64-builder'
Variable with name 'BUILD_DISPLAY_NAME' already exists, current value: 'mesa-buildtest-itoral-m64-builder', new value: 'mesa-buildtest-itoral-m64-builder'
[WARNINGS] Parsing warnings in console log with parser GNU Make + GNU C Compiler (gcc)
[WARNINGS] Computing warning deltas based on reference build vkrunner-itoral-m64-builder
Performing Post build task...
Match found for :python : True
Logical operation result is TRUE
Running script  : rm -rf /tmp/jenkins/${BUILD_NUMBER}
[Leeroy_3] $ /bin/sh -xe /tmp/hudson4571039731368656851.sh
+ rm -rf /tmp/jenkins/6197344
POST BUILD TASK : SUCCESS
END OF POST BUILD TASK : 0
[xUnit] [INFO] - Starting to record.
[xUnit] [INFO] - Processing JUnit
[xUnit] [INFO] - [JUnit] - 1 test report file(s) were found with the pattern 'test/piglit*xml' relative to '/home/jenkins/workspace/Leeroy_3' for the testing framework 'JUnit'.
[xUnit] [INFO] - Processing GoogleTest-1.6
[xUnit] [INFO] - [GoogleTest-1.6] - No test report file(s) were found with the pattern 'test/gtest*xml' relative to '/home/jenkins/workspace/Leeroy_3' for the testing framework 'GoogleTest-1.6'.  Did you enter a pattern relative to the correct directory?  Did you generate the result report(s) for 'GoogleTest-1.6'?
[xUnit] [WARNING] - No test reports found for the metric 'GoogleTest' with the resolved pattern 'test/gtest*xml'.
[xUnit] [INFO] - Skipping the metric tool processing.
[xUnit] [INFO] - Check 'Failed Tests' threshold.
[xUnit] [INFO] - The total number of tests for this category exceeds the specified 'unstable' threshold value.
[xUnit] [INFO] - Setting the build status to UNSTABLE
[xUnit] [INFO] - Stopping recording.
Build step 'Publish xUnit test result report' changed build result to UNSTABLE
Collecting metadata...
Metadata collection done.
Finished: UNSTABLE