log: vulkancts-test_m64_debug_hsw_6:6.log

Started by remote host ::1
Building remotely on hswgt2-02 (hsw hswgt2) in workspace /home/jenkins/workspace/Leeroy
 > git rev-parse --is-inside-work-tree # timeout=10
Fetching changes from 5 remote Git repositories
 > git config remote.craftyguy.url https://gitlab.freedesktop.org/craftyguy/mesa_jenkins.git # timeout=10
Pruning obsolete local branches
Fetching upstream changes from https://gitlab.freedesktop.org/craftyguy/mesa_jenkins.git
 > git --version # timeout=10
Setting http proxy: proxy.jf.intel.com:911
 > git fetch --tags --progress https://gitlab.freedesktop.org/craftyguy/mesa_jenkins.git +refs/heads/*:refs/remotes/craftyguy/* --prune
 > git config remote.dcbaker.url git://github.com/dcbaker/mesa_jenkins # timeout=10
Pruning obsolete local branches
Fetching upstream changes from git://github.com/dcbaker/mesa_jenkins
 > git fetch --tags --progress git://github.com/dcbaker/mesa_jenkins +refs/heads/*:refs/remotes/dcbaker/* --prune
 > git config remote.local.url git://otc-mesa-ci.local/git/mesa_jenkins # timeout=10
Pruning obsolete local branches
Fetching upstream changes from git://otc-mesa-ci.local/git/mesa_jenkins
 > git fetch --tags --progress git://otc-mesa-ci.local/git/mesa_jenkins +refs/heads/*:refs/remotes/local/* --prune
 > git config remote.majanes.url https://gitlab.freedesktop.org/majanes/mesa_jenkins.git # timeout=10
Pruning obsolete local branches
Fetching upstream changes from https://gitlab.freedesktop.org/majanes/mesa_jenkins.git
Setting http proxy: proxy.jf.intel.com:911
 > git fetch --tags --progress https://gitlab.freedesktop.org/majanes/mesa_jenkins.git +refs/heads/*:refs/remotes/majanes/* --prune
 > git config remote.origin.url https://gitlab.freedesktop.org/Mesa_CI/mesa_jenkins.git # timeout=10
Pruning obsolete local branches
Fetching upstream changes from https://gitlab.freedesktop.org/Mesa_CI/mesa_jenkins.git
Setting http proxy: proxy.jf.intel.com:911
 > git fetch --tags --progress https://gitlab.freedesktop.org/Mesa_CI/mesa_jenkins.git +refs/*:refs/remotes/origin/* --prune
 > git rev-parse 725c232eb67dceccf86aaf3fbe778cffdff1b3eb^{commit} # timeout=10
Checking out Revision 725c232eb67dceccf86aaf3fbe778cffdff1b3eb (detached)
 > git config core.sparsecheckout # timeout=10
 > git checkout -f 725c232eb67dceccf86aaf3fbe778cffdff1b3eb
 > git rev-list 725c232eb67dceccf86aaf3fbe778cffdff1b3eb # timeout=10
Set build name.
New build name is 'vulkancts-test-jmcasanova-m64-hsw'
[Leeroy] $ /bin/sh -xe /tmp/hudson5362682952230507284.sh
+ echo project:vulkancts-test arch:m64 result_path:/mnt/jenkins/results/jmcasanova/31778bc7d29d08a2885b4a2bd63f3657/percheckin config:debug type:percheckin revision:crucible=4557aa9 cts=8b0e94d8b deqp=f2cd73c61 drm=4735ca71 glcts=60a7f1b15 mesa=440c6e1d803 mesa_ci=02bc04e5 piglit=9b147652e4 skqp=2441c924425 vkrunner=770cb64 vulkancts=878eb5739 waffle=1ded029 hardware:hsw hash:4ef1662075e9ecdc9902d5f47916c963
project:vulkancts-test arch:m64 result_path:/mnt/jenkins/results/jmcasanova/31778bc7d29d08a2885b4a2bd63f3657/percheckin config:debug type:percheckin revision:crucible=4557aa9 cts=8b0e94d8b deqp=f2cd73c61 drm=4735ca71 glcts=60a7f1b15 mesa=440c6e1d803 mesa_ci=02bc04e5 piglit=9b147652e4 skqp=2441c924425 vkrunner=770cb64 vulkancts=878eb5739 waffle=1ded029 hardware:hsw hash:4ef1662075e9ecdc9902d5f47916c963
+ python -u fetch_sources.py --project=vulkancts-test crucible=4557aa9 cts=8b0e94d8b deqp=f2cd73c61 drm=4735ca71 glcts=60a7f1b15 mesa=440c6e1d803 mesa_ci=02bc04e5 piglit=9b147652e4 skqp=2441c924425 vkrunner=770cb64 vulkancts=878eb5739 waffle=1ded029
Checking out specified commit (try 1/15)
+ ls /mnt/jenkins/results
+ mkdir -p /tmp/jenkins/2982780
+ [ hsw = builder ]
+ killall Xorg
Xorg: no process found
+ true
+ sleep 5
+ rm -rf /tmp/build_root
+ Xorg :0 vt0 -retro -sharevts -noreset
+ sleep 5
+ DISPLAY=:0 xset dpms force on
+ DISPLAY=:0 xset s off
+ python -u vulkancts-test/build.py --arch m64 --result_path /mnt/jenkins/results/jmcasanova/31778bc7d29d08a2885b4a2bd63f3657/percheckin --config debug --type percheckin --hardware hsw --action clean,build,test --shard 6:6 --env DISPLAY=:0 
INFO: starting timer at: 1552559525.7, time remaining is: 3599.99998808
 rsync -rlpzD otc-mesa-ci.local::nfs/results/jmcasanova/31778bc7d29d08a2885b4a2bd63f3657/percheckin/mesa/m64 /tmp/build_root
 rsync -rlpzD otc-mesa-ci.local::nfs/results/jmcasanova/31778bc7d29d08a2885b4a2bd63f3657/percheckin/waffle/m64 /tmp/build_root
 rsync -rlpzD otc-mesa-ci.local::nfs/results/jmcasanova/31778bc7d29d08a2885b4a2bd63f3657/percheckin/vulkancts/m64 /tmp/build_root
 rsync -rlpzD otc-mesa-ci.local::nfs/results/jmcasanova/31778bc7d29d08a2885b4a2bd63f3657/percheckin/drm/m64 /tmp/build_root
 cp -al /tmp/build_root /tmp/orig_build_root
Deleting /home/jenkins/workspace/Leeroy/test
VK_ICD_FILENAMES=/tmp/build_root/m64/share/vulkan/icd.d/intel_icd.x86_64.json DISPLAY=:0 INTEL_PRECISE_TRIG=1 vblank_mode=0 LIBGL_DRIVERS_PATH=/tmp/build_root/m64/lib/dri:/tmp/build_root/m64/lib64/dri:/tmp/build_root/m64/lib/x86_64-linux-gnu/dri:/usr/lib/dri:/usr/lib64/dri:/usr/lib/x86_64-linux-gnu/dri ANV_ABORT_ON_DEVICE_LOSS=true LD_LIBRARY_PATH=/tmp/build_root/m64/lib:/tmp/build_root/m64/lib64:/tmp/build_root/m64/lib/x86_64-linux-gnu:/usr/lib:/usr/lib64:/usr/lib/x86_64-linux-gnu ./deqp-vk --deqp-runmode=xml-caselist
Writing test log into TestResults.qpa
dEQP Core git-aa2fa4aeced6437b213a72ea538aa890232d4c14 (0xaa2fa4ae) starting..
  target implementation = 'Default'
Writing test cases from 'dEQP-VK' to file 'dEQP-VK-cases.xml'..
Using whitelist for 1.1.3
Total test count: 53222

[ 24% ]
[ 25% ]
[ 26% ]
[ 27% ]
[ 28% ]
[ 29% ]
[ 30% ]
[ 31% ]
[ 32% ]
[ 33% ]
[ 34% ]
[ 35% ]
[ 36% ]
[ 37% ]
[ 38% ]
[ 39% ]
[ 40% ]
[ 41% ]
[ 42% ]
[ 43% ]
[ 44% ]
[ 45% ]
[ 46% ]
[ 47% ]
[ 48% ]
[ 49% ]
[ 50% ]
[ 51% ]
[ 52% ]
[ 53% ]
[ 54% ]
[ 55% ]
[ 56% ]
[ 57% ]
[ 58% ]
[ 59% ]
[ 60% ]
[ 61% ]
[ 62% ]
[ 63% ]
[ 64% ]
[ 65% ]
[ 66% ]
[ 67% ]
[ 68% ]
[ 69% ]
[ 70% ]
[ 71% ]
[ 72% ]
[ 73% ]
[ 74% ]
[ 75% ]
[ 76% ]
[ 77% ]
[ 78% ]
[ 79% ]
[ 80% ]
ERROR: *** component timed out.
setting build status to failed
ERROR: gpu hang found: 2019-03-14T03:38:44,645218-07:00  i915_gem_userptr_mn_invalidate_range_start+0x167/0x190 [i915]
ERROR: system must be rebooted.
ERROR: creating a failing test: gpu-hang-otc-gfxtest-hswgt2-02 : 2019-03-14T03:38:44,645218-07:00  i915_gem_userptr_mn_invalidate_range_start+0x167/0x190 [i915]
 rsync -rlpzD /tmp/build_root/test otc-mesa-ci.local::nfs/results/jmcasanova/31778bc7d29d08a2885b4a2bd63f3657/percheckin
 cp -a /tmp/build_root/m64/../test /home/jenkins/workspace/Leeroy
 sudo /usr/local/bin/copy_error_state.sh /tmp/build_root/test/card_error_otc-gfxtest-hswgt2-02 jenkins
opening: http://otc-mesa-ci.jf.intel.com/job/reboot_single/buildWithParameters?token=noauth&label=hswgt2-02
sleeping to allow reboot job to be scheduled.
Killed
Process leaked file descriptors. See http://wiki.jenkins-ci.org/display/JENKINS/Spawning+processes+from+build for more information
Build step 'Execute shell' marked build as failure
Set build name.
New build name is 'vulkancts-test-jmcasanova-m64-hsw'
Variable with name 'BUILD_DISPLAY_NAME' already exists, current value: 'vulkancts-test-jmcasanova-m64-hsw', new value: 'vulkancts-test-jmcasanova-m64-hsw'
[WARNINGS] Skipping publisher since build result is FAILURE
Performing Post build task...
Match found for :python : True
Logical operation result is TRUE
Running script  : rm -rf /tmp/jenkins/${BUILD_NUMBER}
[Leeroy] $ /bin/sh -xe /tmp/hudson8046402445830242837.sh
+ rm -rf /tmp/jenkins/2982780
POST BUILD TASK : SUCCESS
END OF POST BUILD TASK : 0
[xUnit] [INFO] - Starting to record.
[xUnit] [INFO] - Processing JUnit
[xUnit] [INFO] - [JUnit] - 1 test report file(s) were found with the pattern 'test/piglit*xml' relative to '/home/jenkins/workspace/Leeroy' for the testing framework 'JUnit'.
[xUnit] [INFO] - Processing GoogleTest-1.6
[xUnit] [INFO] - [GoogleTest-1.6] - No test report file(s) were found with the pattern 'test/gtest*xml' relative to '/home/jenkins/workspace/Leeroy' for the testing framework 'GoogleTest-1.6'.  Did you enter a pattern relative to the correct directory?  Did you generate the result report(s) for 'GoogleTest-1.6'?
[xUnit] [WARNING] - No test reports found for the metric 'GoogleTest' with the resolved pattern 'test/gtest*xml'.
[xUnit] [INFO] - Skipping the metric tool processing.
[xUnit] [INFO] - Check 'Failed Tests' threshold.
[xUnit] [INFO] - The total number of tests for this category exceeds the specified 'unstable' threshold value.
[xUnit] [INFO] - Setting the build status to FAILURE
[xUnit] [INFO] - Stopping recording.
Collecting metadata...
Metadata collection done.
Finished: FAILURE