log: crucible_m32_debug_builder.log

Started by remote host ::1
Building remotely on builder-02 (builder) in workspace /home/jenkins/workspace/Leeroy
 > git rev-parse --is-inside-work-tree # timeout=10
Fetching changes from 5 remote Git repositories
 > git config remote.local.url git://otc-mesa-ci.local/git/mesa_jenkins # timeout=10
Pruning obsolete local branches
Fetching upstream changes from git://otc-mesa-ci.local/git/mesa_jenkins
 > git --version # timeout=10
 > git fetch --tags --progress git://otc-mesa-ci.local/git/mesa_jenkins +refs/heads/*:refs/remotes/local/* --prune
 > git config remote.origin.url https://gitlab.freedesktop.org/Mesa_CI/mesa_jenkins.git # timeout=10
Pruning obsolete local branches
Fetching upstream changes from https://gitlab.freedesktop.org/Mesa_CI/mesa_jenkins.git
Setting http proxy: proxy.jf.intel.com:911
 > git fetch --tags --progress https://gitlab.freedesktop.org/Mesa_CI/mesa_jenkins.git +refs/heads/*:refs/remotes/origin/* --prune
 > git config remote.origin1.url https://gitlab.freedesktop.org/majanes/mesa_jenkins.git # timeout=10
Pruning obsolete local branches
Fetching upstream changes from https://gitlab.freedesktop.org/majanes/mesa_jenkins.git
Setting http proxy: proxy.jf.intel.com:911
 > git fetch --tags --progress https://gitlab.freedesktop.org/majanes/mesa_jenkins.git +refs/heads/*:refs/remotes/origin1/* --prune
 > git config remote.origin2.url https://gitlab.freedesktop.org/ngcortes/mesa_jenkins.git # timeout=10
Pruning obsolete local branches
Fetching upstream changes from https://gitlab.freedesktop.org/ngcortes/mesa_jenkins.git
Setting http proxy: proxy.jf.intel.com:911
 > git fetch --tags --progress https://gitlab.freedesktop.org/ngcortes/mesa_jenkins.git +refs/heads/*:refs/remotes/origin2/* --prune
 > git config remote.origin3.url https://gitlab.freedesktop.org/craftyguy/mesa_jenkins.git # timeout=10
Pruning obsolete local branches
Fetching upstream changes from https://gitlab.freedesktop.org/craftyguy/mesa_jenkins.git
Setting http proxy: proxy.jf.intel.com:911
 > git fetch --tags --progress https://gitlab.freedesktop.org/craftyguy/mesa_jenkins.git +refs/heads/*:refs/remotes/origin3/* --prune
 > git rev-parse c0a05a3bbdb1c1aa7c88a7db0a3eaf42485c422c^{commit} # timeout=10
Checking out Revision c0a05a3bbdb1c1aa7c88a7db0a3eaf42485c422c (detached)
 > git config core.sparsecheckout # timeout=10
 > git checkout -f c0a05a3bbdb1c1aa7c88a7db0a3eaf42485c422c
 > git rev-list c0a05a3bbdb1c1aa7c88a7db0a3eaf42485c422c # timeout=10
Set build name.
New build name is 'crucible-majanes-m32-builder'
[Leeroy] $ /bin/sh -xe /tmp/hudson3195066263606879882.sh
+ python3 -u fetch_sources.py --project=crucible amber=cc1dec6 crucible=2ec00bc cts=a3087b181 deqp=c880fb0c2 drm=1225171b glcts=7abc8473f glslang=c594de23 kc-cts=64f5eea mesa=5740b2f339a mesa_ci=fc442c27 mesa_ci_internal=196a366 piglit=13ec813f01 spirvheaders=f027d53 spirvtools=3b8523454 vkrunner=1b4cc6b vulkancts=27e691f02 waffle=b6d9448 webgl=619c1194e
Checking out mesa_ci commit (try 1/15)
Checking out mesa_ci_internal commit (try 1/15)
Checking out specified commit (try 1/15)
+ ls /mnt/jenkins/results
+ mkdir -p /tmp/jenkins/5497328
+ [ builder = builder ]
+ unshare -m -r /bin/bash -c 
mount -o bind /tmp/jenkins/5497328 /tmp
unset revision
python3 -u crucible/build.py --arch m32 --result_path /mnt/jenkins/results/majanes/9e6c9a14f25b087878f33e58e97f4514/percheckin --config debug --type percheckin --hardware builder --action clean,build,test --shard 0 --env "" 

INFO: starting timer at: 1614103466.6505876, time remaining is: 1499.999979019165
 rsync -rlpD --exclude='*.o' --exclude='*.a' otc-mesa-ci.local::nfs/results/majanes/9e6c9a14f25b087878f33e58e97f4514/percheckin/mesa/m32 /tmp/build_root
 rsync -rlpD --exclude='*.o' --exclude='*.a' otc-mesa-ci.local::nfs/results/majanes/9e6c9a14f25b087878f33e58e97f4514/percheckin/drm/m32 /tmp/build_root
 cp -al /tmp/build_root /tmp/orig_build_root
 git clean -xfd
Removing Makefile
Removing Makefile.in
Removing aclocal.m4
Removing autom4te.cache/
Removing bin/
Removing compile
Removing config.guess
Removing config.log
Removing config.status
Removing config.sub
Removing configure
Removing data/grass-2048x1024.jpg
Removing data/grass-grayscale-1024x1024.png
Removing data/grass-grayscale-1024x512.png
Removing data/grass-grayscale-128x128.png
Removing data/grass-grayscale-128x64.png
Removing data/grass-grayscale-16x16.png
Removing data/grass-grayscale-16x8.png
Removing data/grass-grayscale-1x1.png
Removing data/grass-grayscale-2048x1024.png
Removing data/grass-grayscale-256x128.png
Removing data/grass-grayscale-256x256.png
Removing data/grass-grayscale-2x1.png
Removing data/grass-grayscale-2x2.png
Removing data/grass-grayscale-32x16.png
Removing data/grass-grayscale-32x32.png
Removing data/grass-grayscale-4x2.png
Removing data/grass-grayscale-4x4.png
Removing data/grass-grayscale-512x256.png
Removing data/grass-grayscale-512x512.png
Removing data/grass-grayscale-64x32.png
Removing data/grass-grayscale-64x64.png
Removing data/grass-grayscale-8x4.png
Removing data/grass-grayscale-8x8.png
Removing data/pink-leaves-2048x1024.jpg
Removing data/pink-leaves-grayscale-1024x1024.png
Removing data/pink-leaves-grayscale-1024x512.png
Removing data/pink-leaves-grayscale-128x128.png
Removing data/pink-leaves-grayscale-128x64.png
Removing data/pink-leaves-grayscale-16x16.png
Removing data/pink-leaves-grayscale-16x8.png
Removing data/pink-leaves-grayscale-1x1.png
Removing data/pink-leaves-grayscale-2048x1024.png
Removing data/pink-leaves-grayscale-256x128.png
Removing data/pink-leaves-grayscale-256x256.png
Removing data/pink-leaves-grayscale-2x1.png
Removing data/pink-leaves-grayscale-2x2.png
Removing data/pink-leaves-grayscale-32x16.png
Removing data/pink-leaves-grayscale-32x32.png
Removing data/pink-leaves-grayscale-4x2.png
Removing data/pink-leaves-grayscale-4x4.png
Removing data/pink-leaves-grayscale-512x256.png
Removing data/pink-leaves-grayscale-512x512.png
Removing data/pink-leaves-grayscale-64x32.png
Removing data/pink-leaves-grayscale-64x64.png
Removing data/pink-leaves-grayscale-8x4.png
Removing data/pink-leaves-grayscale-8x8.png
Removing depcomp
Removing doc/crucible-bootstrap.1
Removing doc/crucible-dump-image.1
Removing doc/crucible-help.1
Removing doc/crucible-ls-tests.1
Removing doc/crucible-run.1
Removing doc/crucible-tutorial.7
Removing doc/crucible-version.1
Removing install-sh
Removing libtool
Removing ltmain.sh
Removing m4/libtool.m4
Removing m4/ltoptions.m4
Removing m4/ltsugar.m4
Removing m4/ltversion.m4
Removing m4/lt~obsolete.m4
Removing missing
Removing src/cmd/.deps/
Removing src/cmd/.dirstamp
Removing src/cmd/bootstrap.o
Removing src/cmd/cmd.o
Removing src/cmd/dump-image.o
Removing src/cmd/help.o
Removing src/cmd/ls_tests.o
Removing src/cmd/main.o
Removing src/cmd/run.o
Removing src/cmd/version.o
Removing src/framework/runner/.deps/
Removing src/framework/runner/.dirstamp
Removing src/framework/runner/master.o
Removing src/framework/runner/runner.o
Removing src/framework/runner/runner_vk.o
Removing src/framework/runner/slave.o
Removing src/framework/test/.deps/
Removing src/framework/test/.dirstamp
Removing src/framework/test/t_cleanup.o
Removing src/framework/test/t_data.o
Removing src/framework/test/t_dump.o
Removing src/framework/test/t_image.o
Removing src/framework/test/t_phase_setup.o
Removing src/framework/test/t_phases.o
Removing src/framework/test/t_result.o
Removing src/framework/test/t_thread.o
Removing src/framework/test/test.o
Removing src/framework/test/test_def.o
Removing src/qonos/.deps/
Removing src/qonos/.dirstamp
Removing src/qonos/qonos.o
Removing src/qonos/qonos_pipeline-spirv.h
Removing src/qonos/qonos_pipeline.o
Removing src/tests/bench/.deps/
Removing src/tests/bench/.dirstamp
Removing src/tests/bench/copy-buffer.o
Removing src/tests/bench/descriptor-pool-reset.o
Removing src/tests/bench/multiview-spirv.h
Removing src/tests/bench/multiview.o
Removing src/tests/bench/queue-submit.o
Removing src/tests/bug/.deps/
Removing src/tests/bug/.dirstamp
Removing src/tests/bug/104809-spirv.h
Removing src/tests/bug/104809.o
Removing src/tests/bug/108909.o
Removing src/tests/bug/108911.o
Removing src/tests/example/.deps/
Removing src/tests/example/.dirstamp
Removing src/tests/example/basic.o
Removing src/tests/example/images.o
Removing src/tests/example/messages.o
Removing src/tests/func/.deps/
Removing src/tests/func/.dirstamp
Removing src/tests/func/4-vertex-buffers-spirv.h
Removing src/tests/func/4-vertex-buffers.o
Removing src/tests/func/amd/.deps/
Removing src/tests/func/amd/.dirstamp
Removing src/tests/func/amd/amd_common.o
Removing src/tests/func/amd/gcn_shader-spirv.h
Removing src/tests/func/amd/gcn_shader.o
Removing src/tests/func/bind-points-spirv.h
Removing src/tests/func/bind-points.o
Removing src/tests/func/buffer/.deps/
Removing src/tests/func/buffer/.dirstamp
Removing src/tests/func/buffer/buffer.o
Removing src/tests/func/buffer_reference/.deps/
Removing src/tests/func/buffer_reference/.dirstamp
Removing src/tests/func/buffer_reference/atomic-spirv.h
Removing src/tests/func/buffer_reference/atomic.o
Removing src/tests/func/buffer_reference/simple-spirv.h
Removing src/tests/func/buffer_reference/simple.o
Removing src/tests/func/calibrated-timestamps.o
Removing src/tests/func/cmd-buffer/.deps/
Removing src/tests/func/cmd-buffer/.dirstamp
Removing src/tests/func/cmd-buffer/secondary.o
Removing src/tests/func/compute-derivative-spirv.h
Removing src/tests/func/compute-derivative.o
Removing src/tests/func/compute-local-id-spirv.h
Removing src/tests/func/compute-local-id.o
Removing src/tests/func/compute-num-workgroups-spirv.h
Removing src/tests/func/compute-num-workgroups.o
Removing src/tests/func/compute-shared-memory-spirv.h
Removing src/tests/func/compute-shared-memory.o
Removing src/tests/func/compute-spirv.h
Removing src/tests/func/compute-subgroup-quad-spirv.h
Removing src/tests/func/compute-subgroup-quad.o
Removing src/tests/func/compute.o
Removing src/tests/func/copy/.deps/
Removing src/tests/func/copy/.dirstamp
Removing src/tests/func/copy/copy-buffer.o
Removing src/tests/func/depthstencil/.deps/
Removing src/tests/func/depthstencil/.dirstamp
Removing src/tests/func/depthstencil/arrayed-clear-spirv.h
Removing src/tests/func/depthstencil/arrayed-clear.o
Removing src/tests/func/depthstencil/basic-spirv.h
Removing src/tests/func/depthstencil/basic.o
Removing src/tests/func/depthstencil/stencil_triangles-spirv.h
Removing src/tests/func/depthstencil/stencil_triangles.o
Removing src/tests/func/desc/.deps/
Removing src/tests/func/desc/.dirstamp
Removing src/tests/func/desc/binding.o
Removing src/tests/func/desc/dynamic-spirv.h
Removing src/tests/func/desc/dynamic.o
Removing src/tests/func/draw-indexed-spirv.h
Removing src/tests/func/draw-indexed.o
Removing src/tests/func/event.o
Removing src/tests/func/first-spirv.h
Removing src/tests/func/first.o
Removing src/tests/func/gs/.deps/
Removing src/tests/func/gs/.dirstamp
Removing src/tests/func/gs/basic-spirv.h
Removing src/tests/func/gs/basic.o
Removing src/tests/func/interleaved-cmd-buffers.o
Removing src/tests/func/memory-budget.o
Removing src/tests/func/memory-fd.o
Removing src/tests/func/miptree/.deps/
Removing src/tests/func/miptree/.dirstamp
Removing src/tests/func/miptree/miptree-spirv.h
Removing src/tests/func/miptree/miptree.o
Removing src/tests/func/miptree/miptree_gen.c
Removing src/tests/func/multiview-spirv.h
Removing src/tests/func/multiview.o
Removing src/tests/func/push-constants/.deps/
Removing src/tests/func/push-constants/.dirstamp
Removing src/tests/func/push-constants/basic-spirv.h
Removing src/tests/func/push-constants/basic.o
Removing src/tests/func/query/.deps/
Removing src/tests/func/query/.dirstamp
Removing src/tests/func/query/timestamp.o
Removing src/tests/func/renderpass/.deps/
Removing src/tests/func/renderpass/.dirstamp
Removing src/tests/func/renderpass/clear.o
Removing src/tests/func/shader/.deps/
Removing src/tests/func/shader/.dirstamp
Removing src/tests/func/shader/constants-spirv.h
Removing src/tests/func/shader/constants.o
Removing src/tests/func/shader/fragcoord-spirv.h
Removing src/tests/func/shader/fragcoord.o
Removing src/tests/func/shader/pack_unpack-spirv.h
Removing src/tests/func/shader/pack_unpack.o
Removing src/tests/func/shader_ballot/.deps/
Removing src/tests/func/shader_ballot/.dirstamp
Removing src/tests/func/shader_ballot/amd_shader_ballot-spirv.h
Removing src/tests/func/shader_ballot/amd_shader_ballot.o
Removing src/tests/func/shader_ballot/ext_shader_ballot-spirv.h
Removing src/tests/func/shader_ballot/ext_shader_ballot.o
Removing src/tests/func/shader_group_vote/.deps/
Removing src/tests/func/shader_group_vote/.dirstamp
Removing src/tests/func/shader_group_vote/ext_shader_subgroup_vote-spirv.h
Removing src/tests/func/shader_group_vote/ext_shader_subgroup_vote.o
Removing src/tests/func/ssbo/.deps/
Removing src/tests/func/ssbo/.dirstamp
Removing src/tests/func/ssbo/interleave-spirv.h
Removing src/tests/func/ssbo/interleave.o
Removing src/tests/func/sync/.deps/
Removing src/tests/func/sync/.dirstamp
Removing src/tests/func/sync/semaphore-fd-spirv.h
Removing src/tests/func/sync/semaphore-fd.o
Removing src/tests/func/ubo/.deps/
Removing src/tests/func/ubo/.dirstamp
Removing src/tests/func/ubo/robust-push-ubo-spirv.h
Removing src/tests/func/ubo/robust-push-ubo.o
Removing src/tests/func/uniform-subgroup-spirv.h
Removing src/tests/func/uniform-subgroup.o
Removing src/tests/self/.deps/
Removing src/tests/self/.dirstamp
Removing src/tests/self/bad-test-names.bash.log
Removing src/tests/self/bad-test-names.bash.trs
Removing src/tests/self/concurrent-output.bash.log
Removing src/tests/self/concurrent-output.bash.trs
Removing src/tests/self/concurrent-output.o
Removing src/tests/self/concurrent-output.stderr
Removing src/tests/self/concurrent-output.stdout
Removing src/tests/stress/.deps/
Removing src/tests/stress/.dirstamp
Removing src/tests/stress/buffer_limit.o
Removing src/tests/stress/lots-of-surface-state-spirv.h
Removing src/tests/stress/lots-of-surface-state.o
Removing src/util/.deps/
Removing src/util/.dirstamp
Removing src/util/cru_cleanup.o
Removing src/util/cru_format.o
Removing src/util/cru_image.o
Removing src/util/cru_ktx_image.o
Removing src/util/cru_pixel_image.o
Removing src/util/cru_png_image.o
Removing src/util/cru_vec.o
Removing src/util/cru_vk_image.o
Removing src/util/log.o
Removing src/util/misc.o
Removing src/util/simple_pipeline-spirv.h
Removing src/util/simple_pipeline.o
Removing src/util/string.o
Removing src/util/xalloc.o
Removing test-driver
Removing test-suite.log
 git reset --hard HEAD
HEAD is now at 2ec00bc framework: Only create one command pool per queue family
 autoreconf --verbose --install -s
autoreconf: Entering directory `.'
autoreconf: configure.ac: not using Gettext
autoreconf: running: aclocal 
autoreconf: configure.ac: tracing
autoreconf: running: libtoolize
libtoolize: putting auxiliary files in '.'.
libtoolize: linking file './ltmain.sh'
libtoolize: putting macros in AC_CONFIG_MACRO_DIRS, 'm4'.
libtoolize: linking file 'm4/libtool.m4'
libtoolize: linking file 'm4/ltoptions.m4'
libtoolize: linking file 'm4/ltsugar.m4'
libtoolize: linking file 'm4/ltversion.m4'
libtoolize: linking file 'm4/lt~obsolete.m4'
libtoolize: Consider adding '-I m4' to ACLOCAL_AMFLAGS in Makefile.am.
autoreconf: running: /usr/bin/autoconf
autoreconf: configure.ac: not using Autoheader
autoreconf: running: automake --add-missing --no-force
configure.ac:26: installing './compile'
configure.ac:26: installing './config.guess'
configure.ac:26: installing './config.sub'
configure.ac:24: installing './install-sh'
configure.ac:24: installing './missing'
Makefile.am: installing './depcomp'
parallel-tests: installing './test-driver'
autoreconf: Leaving directory `.'
PKG_CONFIG_PATH=/tmp/build_root/m32/lib32/pkgconfig:/tmp/build_root/m32/lib/i386-linux-gnu/pkgconfig:/tmp/build_root/m32/lib/pkgconfig:/usr/lib32/pkgconfig:/usr/lib/i386-linux-gnu/pkgconfig:/usr/lib/pkgconfig LD_LIBRARY_PATH=/tmp/build_root/m32/lib32:/tmp/build_root/m32/lib/i386-linux-gnu:/tmp/build_root/m32/lib:/usr/lib32:/usr/lib/i386-linux-gnu:/usr/lib CC=ccache gcc -m32 CXX=ccache g++ -m32 /home/jenkins/workspace/Leeroy/repos/crucible/configure --prefix=/tmp/build_root/m32 CFLAGS=-m32 -msse -msse2  CXXFLAGS=-m32 -msse -msse2  --enable-32-bit --host=i686-pc-linux-gnu GLSLC=/tmp/build_root/m32/bin/glslc MESA_LDFLAGS=-L/tmp/build_root/m32/lib
configure: WARNING: unrecognized options: --enable-32-bit
checking for a BSD-compatible install... /usr/bin/install -c
checking whether build environment is sane... yes
checking for i686-pc-linux-gnu-strip... no
checking for strip... strip
checking for a thread-safe mkdir -p... /bin/mkdir -p
checking for gawk... no
checking for mawk... mawk
checking whether make sets $(MAKE)... yes
checking whether make supports nested variables... yes
checking whether make supports nested variables... (cached) yes
checking build system type... x86_64-pc-linux-gnu
checking host system type... i686-pc-linux-gnu
checking how to print strings... printf
checking whether make supports the include directive... yes (GNU style)
checking for i686-pc-linux-gnu-gcc... ccache gcc -m32
checking whether the C compiler works... yes
checking for C compiler default output file name... a.out
checking for suffix of executables... 
checking whether we are cross compiling... no
checking for suffix of object files... o
checking whether we are using the GNU C compiler... yes
checking whether ccache gcc -m32 accepts -g... yes
checking for ccache gcc -m32 option to accept ISO C89... none needed
checking whether ccache gcc -m32 understands -c and -o together... yes
checking dependency style of ccache gcc -m32... gcc3
checking for a sed that does not truncate output... /bin/sed
checking for grep that handles long lines and -e... /bin/grep
checking for egrep... /bin/grep -E
checking for fgrep... /bin/grep -F
checking for ld used by ccache gcc -m32... /usr/bin/ld
checking if the linker (/usr/bin/ld) is GNU ld... yes
checking for BSD- or MS-compatible name lister (nm)... no
checking for i686-pc-linux-gnu-dumpbin... no
checking for i686-pc-linux-gnu-link... no
checking for dumpbin... no
checking for link... link -dump
checking the name lister (nm) interface... BSD nm
checking whether ln -s works... yes
checking the maximum length of command line arguments... 1572864
checking how to convert x86_64-pc-linux-gnu file names to i686-pc-linux-gnu format... func_convert_file_noop
checking how to convert x86_64-pc-linux-gnu file names to toolchain format... func_convert_file_noop
checking for /usr/bin/ld option to reload object files... -r
checking for i686-pc-linux-gnu-objdump... no
checking for objdump... objdump
checking how to recognize dependent libraries... pass_all
checking for i686-pc-linux-gnu-dlltool... no
checking for dlltool... no
checking how to associate runtime and link libraries... printf %s\n
checking for i686-pc-linux-gnu-ar... no
checking for ar... ar
checking for archiver @FILE support... @
checking for i686-pc-linux-gnu-strip... strip
checking for i686-pc-linux-gnu-ranlib... no
checking for ranlib... ranlib
checking command to parse nm output from ccache gcc -m32 object... ok
checking for sysroot... no
checking for a working dd... /bin/dd
checking how to truncate binary pipes... /bin/dd bs=4096 count=1
checking for i686-pc-linux-gnu-mt... no
checking for mt... mt
checking if mt is a manifest tool... no
checking how to run the C preprocessor... ccache gcc -m32 -E
checking for ANSI C header files... yes
checking for sys/types.h... yes
checking for sys/stat.h... yes
checking for stdlib.h... yes
checking for string.h... yes
checking for memory.h... yes
checking for strings.h... yes
checking for inttypes.h... yes
checking for stdint.h... yes
checking for unistd.h... yes
checking for dlfcn.h... yes
checking for objdir... .libs
checking if ccache gcc -m32 supports -fno-rtti -fno-exceptions... no
checking for ccache gcc -m32 option to produce PIC... -fPIC -DPIC
checking if ccache gcc -m32 PIC flag -fPIC -DPIC works... yes
checking if ccache gcc -m32 static flag -static works... yes
checking if ccache gcc -m32 supports -c -o file.o... yes
checking if ccache gcc -m32 supports -c -o file.o... (cached) yes
checking whether the ccache gcc -m32 linker (/usr/bin/ld) supports shared libraries... yes
checking whether -lc should be explicitly linked in... no
checking dynamic linker characteristics... GNU/Linux ld.so
checking how to hardcode library paths into programs... immediate
checking whether stripping libraries is possible... yes
checking if libtool supports shared libraries... yes
checking whether to build shared libraries... yes
checking whether to build static libraries... yes
checking whether we are using the GNU C++ compiler... yes
checking whether ccache g++ -m32 accepts -g... yes
checking dependency style of ccache g++ -m32... gcc3
checking how to run the C++ preprocessor... ccache g++ -m32 -E
checking for ld used by ccache g++ -m32... /usr/bin/ld
checking if the linker (/usr/bin/ld) is GNU ld... yes
checking whether the ccache g++ -m32 linker (/usr/bin/ld) supports shared libraries... yes
checking for ccache g++ -m32 option to produce PIC... -fPIC -DPIC
checking if ccache g++ -m32 PIC flag -fPIC -DPIC works... yes
checking if ccache g++ -m32 static flag -static works... yes
checking if ccache g++ -m32 supports -c -o file.o... yes
checking if ccache g++ -m32 supports -c -o file.o... (cached) yes
checking whether the ccache g++ -m32 linker (/usr/bin/ld) supports shared libraries... yes
checking dynamic linker characteristics... (cached) GNU/Linux ld.so
checking how to hardcode library paths into programs... immediate
checking for i686-pc-linux-gnu-pkg-config... no
checking for pkg-config... /usr/bin/pkg-config
checking pkg-config is at least version 0.9.0... yes
checking for python3... python3
checking if Python3 OpenCV modules is installed... yes
checking for glslangValidator... glslangValidator
checking for libpng16... yes
checking for libxml-2.0... yes
checking for asciidoc... asciidoc
checking for a2x... a2x
checking that generated files are newer than configure... done
configure: creating ./config.status
config.status: creating Makefile
config.status: executing depfiles commands
config.status: executing libtool commands
configure: WARNING: unrecognized options: --enable-32-bit
 make -j 18
  GEN      src/qonos/qonos_pipeline-spirv.h
  GEN      src/util/simple_pipeline-spirv.h
  GEN      src/tests/bench/multiview-spirv.h
  GEN      src/tests/bug/104809-spirv.h
  GEN      src/tests/func/4-vertex-buffers-spirv.h
  GEN      src/tests/func/depthstencil/basic-spirv.h
  GEN      src/tests/func/depthstencil/arrayed-clear-spirv.h
  GEN      src/tests/func/depthstencil/stencil_triangles-spirv.h
  GEN      src/tests/func/desc/dynamic-spirv.h
  GEN      src/tests/func/draw-indexed-spirv.h
  GEN      src/tests/func/first-spirv.h
  GEN      src/tests/func/gs/basic-spirv.h
  GEN      src/tests/func/compute-local-id-spirv.h
  GEN      src/tests/func/bind-points-spirv.h
  GEN      src/tests/func/compute-spirv.h
  GEN      src/tests/func/compute-derivative-spirv.h
  GEN      src/tests/func/compute-shared-memory-spirv.h
  GEN      src/tests/func/compute-num-workgroups-spirv.h
  GEN      src/tests/func/compute-subgroup-quad-spirv.h
  GEN      src/tests/func/miptree/miptree-spirv.h
  GEN      src/tests/func/miptree/miptree_gen.c
  GEN      src/tests/func/multiview-spirv.h
  GEN      src/tests/func/push-constants/basic-spirv.h
  GEN      src/tests/func/amd/gcn_shader-spirv.h
  GEN      src/tests/func/buffer_reference/atomic-spirv.h
  GEN      src/tests/func/buffer_reference/simple-spirv.h
  GEN      src/tests/func/shader/constants-spirv.h
  GEN      src/tests/func/shader/fragcoord-spirv.h
  GEN      src/tests/func/shader/pack_unpack-spirv.h
  GEN      src/tests/func/shader_ballot/ext_shader_ballot-spirv.h
  GEN      src/tests/func/shader_ballot/amd_shader_ballot-spirv.h
  GEN      src/tests/func/shader_group_vote/ext_shader_subgroup_vote-spirv.h
  GEN      src/tests/func/ssbo/interleave-spirv.h
  GEN      src/tests/func/sync/semaphore-fd-spirv.h
  GEN      src/tests/func/ubo/robust-push-ubo-spirv.h
  GEN      src/tests/stress/lots-of-surface-state-spirv.h
  GEN      src/tests/func/uniform-subgroup-spirv.h
  GEN      data/grass-2048x1024.jpg
  GEN      data/pink-leaves-2048x1024.jpg
  GEN      data/grass-grayscale-1024x1024.png
  GEN      data/grass-grayscale-2048x1024.png
  GEN      data/grass-grayscale-1024x512.png
  GEN      data/grass-grayscale-512x512.png
  GEN      data/grass-grayscale-512x256.png
  GEN      data/grass-grayscale-256x256.png
  GEN      data/grass-grayscale-128x128.png
  GEN      data/grass-grayscale-256x128.png
  GEN      data/grass-grayscale-128x64.png
  GEN      data/grass-grayscale-64x32.png
  GEN      data/grass-grayscale-64x64.png
  GEN      data/grass-grayscale-32x32.png
  GEN      data/grass-grayscale-32x16.png
  GEN      data/grass-grayscale-8x8.png
  GEN      data/grass-grayscale-16x16.png
  GEN      data/grass-grayscale-16x8.png
  GEN      data/grass-grayscale-8x4.png
  GEN      data/grass-grayscale-4x4.png
  GEN      data/grass-grayscale-4x2.png
  GEN      data/grass-grayscale-2x2.png
  GEN      data/grass-grayscale-1x1.png
  GEN      data/grass-grayscale-2x1.png
  GEN      data/pink-leaves-grayscale-2048x1024.png
  GEN      data/pink-leaves-grayscale-1024x1024.png
  GEN      data/pink-leaves-grayscale-1024x512.png
  GEN      data/pink-leaves-grayscale-512x512.png
  GEN      data/pink-leaves-grayscale-512x256.png
  GEN      data/pink-leaves-grayscale-256x256.png
  GEN      data/pink-leaves-grayscale-256x128.png
  GEN      data/pink-leaves-grayscale-128x128.png
  GEN      data/pink-leaves-grayscale-128x64.png
  GEN      data/pink-leaves-grayscale-64x64.png
  GEN      data/pink-leaves-grayscale-64x32.png
  GEN      data/pink-leaves-grayscale-32x32.png
  GEN      data/pink-leaves-grayscale-32x16.png
  GEN      data/pink-leaves-grayscale-16x16.png
  GEN      data/pink-leaves-grayscale-16x8.png
  GEN      data/pink-leaves-grayscale-8x8.png
  GEN      data/pink-leaves-grayscale-8x4.png
  GEN      data/pink-leaves-grayscale-4x4.png
  GEN      data/pink-leaves-grayscale-2x2.png
  GEN      data/pink-leaves-grayscale-4x2.png
  GEN      data/pink-leaves-grayscale-2x1.png
  GEN      data/pink-leaves-grayscale-1x1.png
make  all-am
make[1]: Entering directory '/home/jenkins/workspace/Leeroy/repos/crucible'
  CC       src/tests/func/memory-fd.o
  CC       src/tests/func/calibrated-timestamps.o
  CC       src/tests/func/uniform-subgroup.o
  GEN      doc/crucible-bootstrap.1
  GEN      doc/crucible-dump-image.1
  GEN      doc/crucible-help.1
  GEN      doc/crucible-tutorial.7
  GEN      doc/crucible-ls-tests.1
  GEN      doc/crucible-run.1
  CC       src/cmd/cmd.o
  CC       src/cmd/bootstrap.o
  GEN      doc/crucible-version.1
  CC       src/cmd/dump-image.o
  CC       src/cmd/help.o
  CC       src/cmd/ls_tests.o
  CC       src/cmd/main.o
  CC       src/cmd/run.o
  CC       src/cmd/version.o
  CC       src/framework/runner/master.o
  CC       src/framework/runner/runner.o
  CC       src/framework/runner/runner_vk.o
  CC       src/framework/runner/slave.o
  CC       src/framework/test/t_cleanup.o
  CC       src/framework/test/t_data.o
  CC       src/framework/test/t_dump.o
  CC       src/framework/test/t_image.o
src/tests/func/calibrated-timestamps.c: In function ‘test_command’:
src/tests/func/calibrated-timestamps.c:418:26: error: format ‘%lu’ expects argument of type ‘long unsigned int’, but argument 2 has type ‘uint64_t’ {aka ‘long long unsigned int’} [-Werror=format=]
  418 |         printf("before %lu queue %lu (%ld) after %lu (%ld)\n",
      |                        ~~^
      |                          |
      |                          long unsigned int
      |                        %llu
  419 |                device_time_to_ns(device_time_before),
      |                ~~~~~~~~~~~~~~~~~~~~~~~~~~~~~~~~~~~~~
      |                |
      |                uint64_t {aka long long unsigned int}
src/tests/func/calibrated-timestamps.c:418:36: error: format ‘%lu’ expects argument of type ‘long unsigned int’, but argument 3 has type ‘uint64_t’ {aka ‘long long unsigned int’} [-Werror=format=]
  418 |         printf("before %lu queue %lu (%ld) after %lu (%ld)\n",
      |                                  ~~^
      |                                    |
      |                                    long unsigned int
      |                                  %llu
  419 |                device_time_to_ns(device_time_before),
  420 |                device_time_to_ns(queue_time),
      |                ~~~~~~~~~~~~~~~~~~~~~~~~~~~~~
      |                |
      |                uint64_t {aka long long unsigned int}
src/tests/func/calibrated-timestamps.c:418:41: error: format ‘%ld’ expects argument of type ‘long int’, but argument 4 has type ‘long long int’ [-Werror=format=]
  418 |         printf("before %lu queue %lu (%ld) after %lu (%ld)\n",
      |                                       ~~^
      |                                         |
      |                                         long int
      |                                       %lld
......
  421 |                (int64_t) (device_time_to_ns(queue_time) - device_time_to_ns(device_time_before)),
      |                ~~~~~~~~~~~~~~~~~~~~~~~~~~~~~~~~~~~~~~~~~~~~~~~~~~~~~~~~~~~~~~~~~~~~~~~~~~~~~~~~~
      |                |
      |                long long int
src/tests/func/calibrated-timestamps.c:418:52: error: format ‘%lu’ expects argument of type ‘long unsigned int’, but argument 5 has type ‘uint64_t’ {aka ‘long long unsigned int’} [-Werror=format=]
  418 |         printf("before %lu queue %lu (%ld) after %lu (%ld)\n",
      |                                                  ~~^
      |                                                    |
      |                                                    long unsigned int
      |                                                  %llu
......
  422 |                device_time_to_ns(device_time_after),
      |                ~~~~~~~~~~~~~~~~~~~~~~~~~~~~~~~~~~~~ 
      |                |
      |                uint64_t {aka long long unsigned int}
src/tests/func/calibrated-timestamps.c:418:57: error: format ‘%ld’ expects argument of type ‘long int’, but argument 6 has type ‘long long int’ [-Werror=format=]
  418 |         printf("before %lu queue %lu (%ld) after %lu (%ld)\n",
      |                                                       ~~^
      |                                                         |
      |                                                         long int
      |                                                       %lld
......
  423 |                (int64_t) (device_time_to_ns(device_time_after) - device_time_to_ns(device_time_before)));
      |                ~~~~~~~~~~~~~~~~~~~~~~~~~~~~~~~~~~~~~~~~~~~~~~~~~~~~~~~~~~~~~~~~~~~~~~~~~~~~~~~~~~~~~~~~
      |                |
      |                long long int
cc1: some warnings being treated as errors
make[1]: *** [Makefile:1568: src/tests/func/calibrated-timestamps.o] Error 1
make[1]: *** Waiting for unfinished jobs....
make[1]: Leaving directory '/home/jenkins/workspace/Leeroy/repos/crucible'
make: *** [Makefile:963: all] Error 2
ERROR: command failed
Traceback (most recent call last):
  File "crucible/build.py", line 12, in <module>
    build(CrucibleBuilder())
  File "/home/jenkins/workspace/Leeroy/crucible/../repos/mesa_ci/build_support/build_support.py", line 227, in build
    a()
  File "/home/jenkins/workspace/Leeroy/crucible/../repos/mesa_ci/build_support/builders/crucible_builder.py", line 43, in build
    AutoBuilder.build(self)
  File "/home/jenkins/workspace/Leeroy/crucible/../repos/mesa_ci/build_support/builders/builders.py", line 119, in build
    run_batch_command(["make",  "-j", 
  File "/home/jenkins/workspace/Leeroy/crucible/../repos/mesa_ci/build_support/utils/command.py", line 141, in run_batch_command
    raise subprocess.CalledProcessError(p.returncode,commands) 
subprocess.CalledProcessError: Command '['make', '-j', '18']' returned non-zero exit status 2.
Build step 'Execute shell' marked build as failure
Set build name.
New build name is 'crucible-majanes-m32-builder'
Variable with name 'BUILD_DISPLAY_NAME' already exists, current value: 'crucible-majanes-m32-builder', new value: 'crucible-majanes-m32-builder'
[WARNINGS] Skipping publisher since build result is FAILURE
Performing Post build task...
Match found for :python : True
Logical operation result is TRUE
Running script  : rm -rf /tmp/jenkins/${BUILD_NUMBER}
[Leeroy] $ /bin/sh -xe /tmp/hudson1544684051733604978.sh
+ rm -rf /tmp/jenkins/5497328
POST BUILD TASK : SUCCESS
END OF POST BUILD TASK : 0
[xUnit] [INFO] - Starting to record.
[xUnit] [INFO] - Processing JUnit
[xUnit] [INFO] - [JUnit] - No test report file(s) were found with the pattern 'test/piglit*xml' relative to '/home/jenkins/workspace/Leeroy' for the testing framework 'JUnit'.  Did you enter a pattern relative to the correct directory?  Did you generate the result report(s) for 'JUnit'?
[xUnit] [WARNING] - No test reports found for the metric 'JUnit' with the resolved pattern 'test/piglit*xml'.
[xUnit] [INFO] - Skipping the metric tool processing.
[xUnit] [INFO] - Processing GoogleTest-1.6
[xUnit] [INFO] - [GoogleTest-1.6] - No test report file(s) were found with the pattern 'test/gtest*xml' relative to '/home/jenkins/workspace/Leeroy' for the testing framework 'GoogleTest-1.6'.  Did you enter a pattern relative to the correct directory?  Did you generate the result report(s) for 'GoogleTest-1.6'?
[xUnit] [WARNING] - No test reports found for the metric 'GoogleTest' with the resolved pattern 'test/gtest*xml'.
[xUnit] [INFO] - Skipping the metric tool processing.
[xUnit] [INFO] - There are errors when processing test results.
[xUnit] [INFO] - Skipping tests recording.
Collecting metadata...
Metadata collection done.
Finished: FAILURE