log: vulkancts-test_m64_debug_hsw_2:6.log

Started by remote host ::1
Building remotely on hswgt2-01 (hsw hswgt2) in workspace /home/jenkins/workspace/Leeroy
 > git rev-parse --is-inside-work-tree # timeout=10
Fetching changes from 5 remote Git repositories
 > git config remote.craftyguy.url https://gitlab.freedesktop.org/craftyguy/mesa_jenkins.git # timeout=10
Pruning obsolete local branches
Fetching upstream changes from https://gitlab.freedesktop.org/craftyguy/mesa_jenkins.git
 > git --version # timeout=10
Setting http proxy: proxy.jf.intel.com:911
 > git fetch --tags --progress https://gitlab.freedesktop.org/craftyguy/mesa_jenkins.git +refs/heads/*:refs/remotes/craftyguy/* --prune
 > git config remote.dcbaker.url https://gitlab.freedesktop.org/ngcortes/mesa_jenkins.git # timeout=10
Pruning obsolete local branches
Fetching upstream changes from https://gitlab.freedesktop.org/ngcortes/mesa_jenkins.git
Setting http proxy: proxy.jf.intel.com:911
 > git fetch --tags --progress https://gitlab.freedesktop.org/ngcortes/mesa_jenkins.git +refs/heads/*:refs/remotes/dcbaker/* --prune
 > git config remote.local.url git://otc-mesa-ci.local/git/mesa_jenkins # timeout=10
Pruning obsolete local branches
Fetching upstream changes from git://otc-mesa-ci.local/git/mesa_jenkins
 > git fetch --tags --progress git://otc-mesa-ci.local/git/mesa_jenkins +refs/heads/*:refs/remotes/local/* --prune
 > git config remote.majanes.url https://gitlab.freedesktop.org/majanes/mesa_jenkins.git # timeout=10
Pruning obsolete local branches
Fetching upstream changes from https://gitlab.freedesktop.org/majanes/mesa_jenkins.git
Setting http proxy: proxy.jf.intel.com:911
 > git fetch --tags --progress https://gitlab.freedesktop.org/majanes/mesa_jenkins.git +refs/heads/*:refs/remotes/majanes/* --prune
 > git config remote.origin.url https://gitlab.freedesktop.org/Mesa_CI/mesa_jenkins.git # timeout=10
Pruning obsolete local branches
Fetching upstream changes from https://gitlab.freedesktop.org/Mesa_CI/mesa_jenkins.git
Setting http proxy: proxy.jf.intel.com:911
 > git fetch --tags --progress https://gitlab.freedesktop.org/Mesa_CI/mesa_jenkins.git +refs/*:refs/remotes/origin/* --prune
 > git rev-parse 0276d2351f8ca68d2e5cb238b5f93bb6a4fb43ff^{commit} # timeout=10
Checking out Revision 0276d2351f8ca68d2e5cb238b5f93bb6a4fb43ff (detached)
 > git config core.sparsecheckout # timeout=10
 > git checkout -f 0276d2351f8ca68d2e5cb238b5f93bb6a4fb43ff
 > git rev-list 0276d2351f8ca68d2e5cb238b5f93bb6a4fb43ff # timeout=10
Set build name.
New build name is 'vulkancts-test-pzanoni-m64-hsw'
[Leeroy] $ /bin/sh -xe /tmp/hudson8629605070043741336.sh
+ python3 -u fetch_sources.py --project=vulkancts-test crucible=ae2fae4 cts=45fb7803b deqp=ee2101f34 drm=c7d89412 glcts=00b074faa glslang=664ad418 gtest=f7922ef5 kc-cts=a3a5c6d mesa=db30fa21e1f mesa_ci=914e40aa mesa_ci_internal=f94e88c piglit=f948be9e07 spirvheaders=38cafab spirvtools=b218ad19 vkrunner=501009d vulkancts=27e691f02 waffle=a1215f4 webgl=3c364b001
Checking out mesa_ci commit (try 1/15)
Checking out mesa_ci_internal commit (try 1/15)
fetching git://otc-mesa-ci.local/git/mesa
error fetching: Cmd('git') failed due to: exit code(1)
  cmdline: git fetch origin
  stderr: 'error: cannot lock ref 'refs/remotes/ci_mesa_repo/dev/craftyguy/perf': 'refs/remotes/ci_mesa_repo/dev/craftyguy' exists; cannot create 'refs/remotes/ci_mesa_repo/dev/craftyguy/perf'
 ! [new ref]                 refs/ci_mesa_repo/dev/craftyguy/perf -> ci_mesa_repo/dev/craftyguy/perf  (unable to update local ref)
 + b77a27d3beb...db30fa21e1f refs/ci_mesa_repo/dev/pzanoni -> ci_mesa_repo/dev/pzanoni  (forced update)
 + 676b30c2362...977b47cbcf9 refs/eric_engestrom/commit-to-branches -> eric_engestrom/commit-to-branches  (forced update)
   680ca5b3938..46c368907fc  master                        -> heads/master
 * [new ref]                 refs/kusma/d3d12-ubo-lower-conditional -> kusma/d3d12-ubo-lower-conditional
 + aa31f7344e1...9f93b8c11dc refs/merge-requests/1902/merge -> merge-requests/1902/merge  (forced update)
 + 5f5fc0e448e...d025b642f65 refs/merge-requests/2073/merge -> merge-requests/2073/merge  (forced update)
error fetching: Cmd('git') failed due to: exit code(1)
  cmdline: git fetch origin
  stderr: 'error: cannot lock ref 'refs/remotes/ci_mesa_repo/dev/craftyguy/perf': 'refs/remotes/ci_mesa_repo/dev/craftyguy' exists; cannot create 'refs/remotes/ci_mesa_repo/dev/craftyguy/perf'
From git://otc-mesa-ci.local/git/mesa
 ! [new ref]                 refs/ci_mesa_repo/dev/craftyguy/perf -> ci_mesa_repo/dev/craftyguy/perf  (unable to update local ref)
error: cannot lock ref 'refs/remotes/robclark/wip': 'refs/remotes/robclark/wip/a6xx-3d-layout' exists; cannot create 'refs/remotes/robclark/wip'
 ! [new ref]                 refs/robclark/wip -> robclark/wip  (unable to update local ref)'
error fetching: Cmd('git') failed due to: exit code(1)
  cmdline: git fetch origin
  stderr: 'error: cannot lock ref 'refs/remotes/ci_mesa_repo/dev/craftyguy/perf': 'refs/remotes/ci_mesa_repo/dev/craftyguy' exists; cannot create 'refs/remotes/ci_mesa_repo/dev/craftyguy/perf'
From git://otc-mesa-ci.local/git/mesa
 ! [new ref]                 refs/ci_mesa_repo/dev/craftyguy/perf -> ci_mesa_repo/dev/craftyguy/perf  (unable to update local ref)
error: cannot lock ref 'refs/remotes/robclark/wip': 'refs/remotes/robclark/wip/a6xx-3d-layout' exists; cannot create 'refs/remotes/robclark/wip'
 ! [new ref]                 refs/robclark/wip -> robclark/wip  (unable to update local ref)'
Failed to fetch remote, ignoring: origin
Checking out specified commit (try 1/15)
+ ls /mnt/jenkins/results
+ mkdir -p /tmp/jenkins/4589610
+ [ hsw = builder ]
+ python3 -u vulkancts-test/build.py --arch m64 --result_path /mnt/jenkins/results/pzanoni/eb18b87c83d3760c8e26476806c62af2/percheckin --config debug --type percheckin --hardware hsw --action clean,build,test --shard 2:6 --env DISPLAY=:0  --startx
INFO: starting timer at: 1592346017.22569, time remaining is: 3599.9999878406525
 rsync -rlpD --exclude='*.o' --exclude='*.a' otc-mesa-ci.local::nfs/results/pzanoni/eb18b87c83d3760c8e26476806c62af2/percheckin/vulkancts/m64 /tmp/build_root
 rsync -rlpD --exclude='*.o' --exclude='*.a' otc-mesa-ci.local::nfs/results/pzanoni/eb18b87c83d3760c8e26476806c62af2/percheckin/mesa/m64 /tmp/build_root
 rsync -rlpD --exclude='*.o' --exclude='*.a' otc-mesa-ci.local::nfs/results/pzanoni/eb18b87c83d3760c8e26476806c62af2/percheckin/drm/m64 /tmp/build_root
 rsync -rlpD --exclude='*.o' --exclude='*.a' otc-mesa-ci.local::nfs/results/pzanoni/eb18b87c83d3760c8e26476806c62af2/percheckin/waffle/m64 /tmp/build_root
 cp -al /tmp/build_root /tmp/orig_build_root
Deleting /home/jenkins/workspace/Leeroy/test
 killall Xorg
Xorg: no process found
LD_LIBRARY_PATH=/tmp/build_root/m64/lib:/tmp/build_root/m64/lib64:/tmp/build_root/m64/lib/x86_64-linux-gnu:/usr/lib:/usr/lib64:/usr/lib/x86_64-linux-gnu:/tmp/build_root/m64/lib/dri:/tmp/build_root/m64/lib64/dri:/tmp/build_root/m64/lib/x86_64-linux-gnu/dri:/usr/lib/dri:/usr/lib64/dri:/usr/lib/x86_64-linux-gnu/dri LIBGL_DRIVERS_PATH=/tmp/build_root/m64/lib/dri:/tmp/build_root/m64/lib64/dri:/tmp/build_root/m64/lib/x86_64-linux-gnu/dri:/usr/lib/dri:/usr/lib64/dri:/usr/lib/x86_64-linux-gnu/dri DISPLAY=:0 Xorg :0 vt0 -retro -sharevts -noreset

X.Org X Server 1.20.8
X Protocol Version 11, Revision 0
Build Operating System: Linux 4.19.0-8-amd64 x86_64 Debian
Current Operating System: Linux otc-gfxtest-hswgt2-01 4.19.0-2-amd64 #1 SMP Debian 4.19.16-1 (2019-01-17) x86_64
Kernel command line: BOOT_IMAGE=/boot/vmlinuz-4.19.0-2-amd64 root=UUID=10222755-9d8e-4ed9-a8e4-37831b7d6110 ro pcie_aspm=off i915.force_probe=* noibrs noibpb nopti nospectre_v2 nospectre_v1 l1tf=off nospec_store_bypass_disable no_stf_barrier mds=off tsx=on tsx_async_abort=off mitigations=off quiet
Build Date: 31 March 2020  10:14:40AM
xorg-server 2:1.20.8-2 (https://www.debian.org/support) 
Current version of pixman: 0.36.0
	Before reporting problems, check http://wiki.x.org
	to make sure that you have the latest version.
Markers: (--) probed, (**) from config file, (==) default setting,
	(++) from command line, (!!) notice, (II) informational,
	(WW) warning, (EE) error, (NI) not implemented, (??) unknown.
(==) Log file: "/var/log/Xorg.0.log", Time: Tue Jun 16 15:21:08 2020
(==) Using config directory: "/etc/X11/xorg.conf.d"
(==) Using system config directory "/usr/share/X11/xorg.conf.d"
(II) modeset(0): Initializing kms color map for depth 24, 8 bpc.
LD_LIBRARY_PATH=/tmp/build_root/m64/lib:/tmp/build_root/m64/lib64:/tmp/build_root/m64/lib/x86_64-linux-gnu:/usr/lib:/usr/lib64:/usr/lib/x86_64-linux-gnu:/tmp/build_root/m64/lib/dri:/tmp/build_root/m64/lib64/dri:/tmp/build_root/m64/lib/x86_64-linux-gnu/dri:/usr/lib/dri:/usr/lib64/dri:/usr/lib/x86_64-linux-gnu/dri LIBGL_DRIVERS_PATH=/tmp/build_root/m64/lib/dri:/tmp/build_root/m64/lib64/dri:/tmp/build_root/m64/lib/x86_64-linux-gnu/dri:/usr/lib/dri:/usr/lib64/dri:/usr/lib/x86_64-linux-gnu/dri DISPLAY=:0 xset dpms force on
LD_LIBRARY_PATH=/tmp/build_root/m64/lib:/tmp/build_root/m64/lib64:/tmp/build_root/m64/lib/x86_64-linux-gnu:/usr/lib:/usr/lib64:/usr/lib/x86_64-linux-gnu:/tmp/build_root/m64/lib/dri:/tmp/build_root/m64/lib64/dri:/tmp/build_root/m64/lib/x86_64-linux-gnu/dri:/usr/lib/dri:/usr/lib64/dri:/usr/lib/x86_64-linux-gnu/dri LIBGL_DRIVERS_PATH=/tmp/build_root/m64/lib/dri:/tmp/build_root/m64/lib64/dri:/tmp/build_root/m64/lib/x86_64-linux-gnu/dri:/usr/lib/dri:/usr/lib64/dri:/usr/lib/x86_64-linux-gnu/dri DISPLAY=:0 xset s off
Checking for support for gbm
LD_LIBRARY_PATH=/tmp/build_root/m64/lib:/tmp/build_root/m64/lib64:/tmp/build_root/m64/lib/x86_64-linux-gnu:/usr/lib:/usr/lib64:/usr/lib/x86_64-linux-gnu:/tmp/build_root/m64/lib/dri:/tmp/build_root/m64/lib64/dri:/tmp/build_root/m64/lib/x86_64-linux-gnu/dri:/usr/lib/dri:/usr/lib64/dri:/usr/lib/x86_64-linux-gnu/dri LIBGL_DRIVERS_PATH=/tmp/build_root/m64/lib/dri:/tmp/build_root/m64/lib64/dri:/tmp/build_root/m64/lib/x86_64-linux-gnu/dri:/usr/lib/dri:/usr/lib64/dri:/usr/lib/x86_64-linux-gnu/dri DISPLAY=:0 /tmp/build_root/m64/bin/wflinfo --platform=gbm -a gl
b'Waffle platform: gbm\nWaffle api: gl\nOpenGL vendor string: Intel Open Source Technology Center\nOpenGL renderer string: Mesa DRI Intel(R) HD Graphics 4600 (HSW GT2)\nOpenGL version string: 3.0 Mesa 20.2.0-devel (git-db30fa21e1)\n'
Checking for support for glx
LD_LIBRARY_PATH=/tmp/build_root/m64/lib:/tmp/build_root/m64/lib64:/tmp/build_root/m64/lib/x86_64-linux-gnu:/usr/lib:/usr/lib64:/usr/lib/x86_64-linux-gnu:/tmp/build_root/m64/lib/dri:/tmp/build_root/m64/lib64/dri:/tmp/build_root/m64/lib/x86_64-linux-gnu/dri:/usr/lib/dri:/usr/lib64/dri:/usr/lib/x86_64-linux-gnu/dri LIBGL_DRIVERS_PATH=/tmp/build_root/m64/lib/dri:/tmp/build_root/m64/lib64/dri:/tmp/build_root/m64/lib/x86_64-linux-gnu/dri:/usr/lib/dri:/usr/lib64/dri:/usr/lib/x86_64-linux-gnu/dri DISPLAY=:0 /tmp/build_root/m64/bin/wflinfo --platform=glx -a gl
b'Waffle platform: glx\nWaffle api: gl\nOpenGL vendor string: Intel Open Source Technology Center\nOpenGL renderer string: Mesa DRI Intel(R) HD Graphics 4600 (HSW GT2)\nOpenGL version string: 3.0 Mesa 20.2.0-devel (git-db30fa21e1)\n'
VK_ICD_FILENAMES=/tmp/build_root/m64/share/vulkan/icd.d/intel_icd.x86_64.json ANV_ABORT_ON_DEVICE_LOSS=true MESA_VK_WSI_PRESENT_MODE=immediate LD_LIBRARY_PATH=/tmp/build_root/m64/lib:/tmp/build_root/m64/lib64:/tmp/build_root/m64/lib/x86_64-linux-gnu:/usr/lib:/usr/lib64:/usr/lib/x86_64-linux-gnu LIBGL_DRIVERS_PATH=/tmp/build_root/m64/lib/dri:/tmp/build_root/m64/lib64/dri:/tmp/build_root/m64/lib/x86_64-linux-gnu/dri:/usr/lib/dri:/usr/lib64/dri:/usr/lib/x86_64-linux-gnu/dri INTEL_PRECISE_TRIG=1 vblank_mode=0 DISPLAY=:0 ./deqp-vk --deqp-runmode=xml-caselist
Writing test log into TestResults.qpa
dEQP Core git-27e691f021138bf902672d67205c1fe2c22b04a7 (0x27e691f0) starting..
  target implementation = 'Default'
Writing test cases from 'dEQP-VK' to file 'dEQP-VK-cases.xml'..
Using single whitelist
Using blacklists:
/home/jenkins/workspace/Leeroy/vulkancts-test/hsw_blacklist.conf
/home/jenkins/workspace/Leeroy/vulkancts-test/blacklist.conf
/home/jenkins/workspace/Leeroy/vulkancts-test/non-daily_blacklist.conf
Total test count: 78563

[ 8.22% ]
[ 11.64% ]
[ 14.78% ]
[ 15.96% ]
[ 16.32% ]
[ 16.84% ]
[ 17.34% ]
[ 17.8% ]
[ 18.41% ]
[ 19.01% ]
[ 19.47% ]
[ 19.72% ]
[ 20.09% ]
[ 20.47% ]
[ 20.72% ]
[ 21.21% ]
[ 21.63% ]
[ 22.04% ]
[ 22.58% ]
[ 22.85% ]
[ 23.17% ]
[ 23.58% ]
[ 24.03% ]
[ 25.06% ]
[ 26.76% ]
[ 28.84% ]
[ 31.77% ]
[ 34.04% ]
[ 36.16% ]
[ 37.72% ]
[ 38.82% ]
[ 39.92% ]
[ 40.88% ]
[ 41.75% ]
[ 42.78% ]
[ 43.91% ]
[ 45.26% ]
[ 46.97% ]
[ 48.44% ]
[ 49.88% ]
[ 50.77% ]
[ 51.41% ]
[ 51.84% ]
[ 52.46% ]
[ 53.17% ]
[ 53.62% ]
[ 54.06% ]
[ 54.27% ]
[ 54.64% ]
[ 54.98% ]
[ 55.34% ]
[ 55.74% ]
[ 56.02% ]
[ 56.23% ]
[ 56.59% ]
[ 56.97% ]
[ 57.37% ]
[ 57.91% ]
[ 58.4% ]
[ 59.31% ]
[ 60.13% ]
[ 61.0% ]
[ 61.61% ]
[ 61.92% ]
[ 62.23% ]
[ 62.54% ]
[ 62.86% ]
[ 63.11% ]
[ 63.31% ]
[ 63.52% ]
[ 63.72% ]
[ 63.78% ]
[ 63.81% ]
[ 63.89% ]
[ 64.25% ]
[ 64.53% ]
[ 64.8% ]
[ 65.04% ]
[ 65.13% ]
[ 65.26% ]
[ 65.66% ]
[ 66.23% ]
[ 66.81% ]
[ 67.33% ]
[ 67.75% ]
[ 68.67% ]
[ 69.38% ]
[ 70.28% ]
[ 70.54% ]
[ 70.66% ]
[ 70.69% ]
[ 70.83% ]
[ 71.05% ]
[ 71.24% ]
[ 71.32% ]
[ 71.45% ]
[ 71.66% ]
[ 72.07% ]
[ 72.23% ]
[ 72.44% ]
[ 72.67% ]
[ 73.04% ]
[ 73.37% ]
[ 73.59% ]
[ 73.75% ]
[ 73.89% ]
[ 73.99% ]
[ 74.12% ]
[ 74.36% ]
[ 74.45% ]
[ 74.48% ]
[ 74.51% ]
[ 74.53% ]
[ 74.59% ]
[ 74.63% ]
[ 74.65% ]
[ 74.7% ]
[ 74.75% ]
[ 74.84% ]
[ 75.06% ]
[ 75.4% ]
[ 75.5% ]
[ 75.68% ]
[ 76.19% ]
[ 76.27% ]
ERROR: *** component timed out.
setting build status to failed
ERROR: gpu hang found: 2020-06-16T15:25:44,457242-07:00  i915_gem_userptr_mn_invalidate_range_start+0x167/0x190 [i915]
 sudo /usr/local/bin/copy_error_state.sh /tmp/build_root/test/card_error_otc-gfxtest-hswgt2-01 jenkins
ERROR: creating a failing test: gpu-hang-otc-gfxtest-hswgt2-01 : 2020-06-16T15:25:44,457242-07:00  i915_gem_userptr_mn_invalidate_range_start+0x167/0x190 [i915]
 rsync -rlpD --exclude='*.o' --exclude='*.a' /tmp/build_root/test otc-mesa-ci.local::nfs/results/pzanoni/eb18b87c83d3760c8e26476806c62af2/percheckin
 cp -a /tmp/build_root/m64/../test /home/jenkins/workspace/Leeroy
ERROR: system must be rebooted.
opening: http://otc-mesa-ci.jf.intel.com/job/reboot_single/buildWithParameters?token=noauth&label=hswgt2-01
sleeping to allow reboot job to be scheduled.
Killed
Process leaked file descriptors. See http://wiki.jenkins-ci.org/display/JENKINS/Spawning+processes+from+build for more information
Build step 'Execute shell' marked build as failure
Set build name.
New build name is 'vulkancts-test-pzanoni-m64-hsw'
Variable with name 'BUILD_DISPLAY_NAME' already exists, current value: 'vulkancts-test-pzanoni-m64-hsw', new value: 'vulkancts-test-pzanoni-m64-hsw'
[WARNINGS] Skipping publisher since build result is FAILURE
Performing Post build task...
Match found for :python : True
Logical operation result is TRUE
Running script  : rm -rf /tmp/jenkins/${BUILD_NUMBER}
[Leeroy] $ /bin/sh -xe /tmp/hudson696475037610347791.sh
+ rm -rf /tmp/jenkins/4589610
POST BUILD TASK : SUCCESS
END OF POST BUILD TASK : 0
[xUnit] [INFO] - Starting to record.
[xUnit] [INFO] - Processing JUnit
[xUnit] [INFO] - [JUnit] - 1 test report file(s) were found with the pattern 'test/piglit*xml' relative to '/home/jenkins/workspace/Leeroy' for the testing framework 'JUnit'.
[xUnit] [INFO] - Processing GoogleTest-1.6
[xUnit] [INFO] - [GoogleTest-1.6] - No test report file(s) were found with the pattern 'test/gtest*xml' relative to '/home/jenkins/workspace/Leeroy' for the testing framework 'GoogleTest-1.6'.  Did you enter a pattern relative to the correct directory?  Did you generate the result report(s) for 'GoogleTest-1.6'?
[xUnit] [WARNING] - No test reports found for the metric 'GoogleTest' with the resolved pattern 'test/gtest*xml'.
[xUnit] [INFO] - Skipping the metric tool processing.
[xUnit] [INFO] - Check 'Failed Tests' threshold.
[xUnit] [INFO] - The total number of tests for this category exceeds the specified 'unstable' threshold value.
[xUnit] [INFO] - Setting the build status to FAILURE
[xUnit] [INFO] - Stopping recording.
Collecting metadata...
Metadata collection done.
Finished: FAILURE